{"text_format":"3","workbook":"xlsx","n_sheets":7,"sheets":["廃棄物事業経費（市町村）","廃棄物事業経費（組合）","廃棄物事業経費（歳入）","廃棄物事業経費（歳出）","組合分担金内訳","市町村分担金内訳","経費集計"],"not_rendered":{"defined_names":19},"read":"whole","date_system":"1900"}

{"sheet":"廃棄物事業経費（市町村）","index":0,"n_rows":33,"n_cols":114,"rows_kept":33,"merged":[[1,0,5,0],[1,1,5,1],[1,2,5,2],[3,37,4,37],[3,65,4,65],[3,93,4,93]]}
["廃棄物処理事業経費（市区町村の合計）（平成28年度実績）"]
["都道府県名","地方公共団体コード","市区町村名","ごみ",{"$nulls":8},"し尿",{"$nulls":8},"合計",{"$nulls":8},"ごみ（建設改良費＋処理維持管理費＋その他）（組合分担金を除く）",{"$nulls":27},"し尿（建設改良費＋処理維持管理費＋その他）（組合分担金を除く）",{"$nulls":27},"合計（建設改良費＋処理維持管理費＋その他）（組合分担金を除く）"]
[{"$nulls":3},"合計 (特定財源(市区町村分担金を除く)+一般財源)",{"$nulls":8},"合計 (特定財源(市区町村分担金を除く)+一般財源)",{"$nulls":8},"合計 (特定財源(市区町村分担金を除く)+一般財源)",{"$nulls":8},"建設改良費 (工事費+調査費)(組合分担金を除く)",{"$nulls":7},"処理及び維持管理費 (人件費+処理費+車両購入費+委託費+調査研究費)(組合分担金を除く)",{"$nulls":17},"その他","合計","建設改良費 (工事費+調査費)(組合分担金を除く)",{"$nulls":7},"処理及び維持管理費 (人件費+処理費+車両購入費+委託費+調査研究費)(組合分担金を除く)",{"$nulls":17},"その他","合計","建設改良費 (工事費+調査費)(組合分担金を除く)",{"$nulls":7},"処理及び維持管理費 (人件費+処理費+車両購入費+委託費+調査研究費)(組合分担金を除く)",{"$nulls":17},"その他","合計"]
[{"$nulls":4},"特定財源 (市区町村分担金を除く)",{"$nulls":6},"一般財源",null,"特定財源 (市区町村分担金を除く)",{"$nulls":6},"一般財源",null,"特定財源 (市区町村分担金を除く)",{"$nulls":6},"一般財源","合計","工事費 (中間処理施設+最終処分場+その他)",{"$nulls":4},"調査費","（建設改良費組合分担金）","合計","人件費（一般職＋収集運搬＋中間処理＋最終処分）",{"$nulls":4},"処理費 (収集運搬費+中間処理費+最終処分費)",{"$nulls":3},"車両等購入費","委託費 (収集運搬費+中間処理費+最終処分費+その他)",{"$nulls":4},"(組合分担金)","調査研究費",null,null,"合計","工事費 (中間処理施設+最終処分場+その他)",{"$nulls":4},"調査費","（建設改良費組合分担金）","合計","人件費（一般職＋収集運搬＋中間処理＋最終処分）",{"$nulls":4},"処理費 (収集運搬費+中間処理費+最終処分費)",{"$nulls":3},"車両等購入費","委託費 (収集運搬費+中間処理費+最終処分費+その他)",{"$nulls":4},"(組合分担金)","調査研究費",null,null,"合計","工事費 (中間処理施設+最終処分場+その他)",{"$nulls":4},"調査費","（建設改良費組合分担金）","合計","人件費（一般職＋収集運搬＋中間処理＋最終処分）",{"$nulls":4},"処理費 (収集運搬費+中間処理費+最終処分費)",{"$nulls":3},"車両等購入費","委託費 (収集運搬費+中間処理費+最終処分費+その他)",{"$nulls":4},"(組合分担金)","調査研究費"]
[{"$nulls":5},"国庫支出金","都道府県\n支出金","地方債","使用料及び\n手数料","（市区町村\n分担金）","その他",{"$nulls":3},"国庫支出金","都道府県\n支出金","地方債","使用料及び\n手数料","（市区町村\n分担金）","その他",{"$nulls":3},"国庫支出金","都道府県\n支出金","地方債","使用料及び\n手数料","（市区町村\n分担金）","その他",null,null,"合計","収集運搬施設","中間処理施設","最終処分場","その他",{"$nulls":4},"一般職","収集運搬","中間処理","最終処分","合計","収集運搬費","中間処理費","最終処分費",null,null,"収集運搬費","中間処理費","最終処分費","その他",{"$nulls":5},"合計","収集運搬施設","中間処理施設","最終処分場","その他",{"$nulls":4},"一般職","収集運搬","中間処理","最終処分","合計","収集運搬費","中間処理費","最終処分費",null,null,"収集運搬費","中間処理費","最終処分費","その他",{"$nulls":5},"合計","収集運搬施設","中間処理施設","最終処分場","その他",{"$nulls":4},"一般職","収集運搬","中間処理","最終処分","合計","収集運搬費","中間処理費","最終処分費",null,null,"収集運搬費","中間処理費","最終処分費","その他"]
[{"$nulls":3},"（千円）","（千円）","（千円）","（千円）","（千円）","（千円）","（千円）","（千円）","（千円）","（千円）","（千円）","（千円）","（千円）","（千円）","（千円）","（千円）","（千円）","（千円）","（千円）","（千円）","（千円）","（千円）","（千円）","（千円）","（千円）","（千円）","（千円）","（千円）","（千円）","（千円）","（千円）","（千円）","（千円）","（千円）","（千円）","（千円）","（千円）","（千円）","（千円）","（千円）","（千円）","（千円）","（千円）","（千円）","（千円）","（千円）","（千円）","（千円）","（千円）","（千円）","（千円）","（千円）","（千円）","（千円）","（千円）","（千円）","（千円）","（千円）","（千円）","（千円）","（千円）","（千円）","（千円）","（千円）","（千円）","（千円）","（千円）","（千円）","（千円）","（千円）","（千円）","（千円）","（千円）","（千円）","（千円）","（千円）","（千円）","（千円）","（千円）","（千円）","（千円）","（千円）","（千円）","（千円）","（千円）","（千円）","（千円）","（千円）","（千円）","（千円）","（千円）","（千円）","（千円）","（千円）","（千円）","（千円）","（千円）","（千円）","（千円）","（千円）","（千円）","（千円）","（千円）","（千円）","（千円）","（千円）","（千円）","（千円）","（千円）","（千円）","（千円）"]
{"$rows_left_out":28}
{"sheet":"廃棄物事業経費（組合）","index":1,"n_rows":14,"n_cols":114,"rows_kept":14,"merged":[[1,0,5,0],[1,1,5,1],[1,2,5,2],[3,37,4,37],[3,65,4,65],[3,93,4,93]]}
["廃棄物処理事業経費（一部事務組合・広域連合の合計）（平成28年度実績）"]
["都道府県名","地方公共団体コード","一部事務組合・広域連合名","ごみ",{"$nulls":8},"し尿",{"$nulls":8},"合計",{"$nulls":8},"ごみ（建設改良費＋処理維持管理費＋その他）（組合分担金を除く）",{"$nulls":27},"し尿（建設改良費＋処理維持管理費＋その他）（組合分担金を除く）",{"$nulls":27},"合計（建設改良費＋処理維持管理費＋その他）（組合分担金を除く）"]
[{"$nulls":3},"合計 (特定財源(市区町村分担金を除く)+一般財源)",{"$nulls":8},"合計 (特定財源(市区町村分担金を除く)+一般財源)",{"$nulls":8},"合計 (特定財源(市区町村分担金を除く)+一般財源)",{"$nulls":8},"建設改良費 (工事費+調査費)(組合分担金を除く)",{"$nulls":7},"処理及び維持管理費 (人件費+処理費+車両購入費+委託費+調査研究費)(組合分担金を除く)",{"$nulls":17},"その他","合計","建設改良費 (工事費+調査費)(組合分担金を除く)",{"$nulls":7},"処理及び維持管理費 (人件費+処理費+車両購入費+委託費+調査研究費)(組合分担金を除く)",{"$nulls":17},"その他","合計","建設改良費 (工事費+調査費)(組合分担金を除く)",{"$nulls":7},"処理及び維持管理費 (人件費+処理費+車両購入費+委託費+調査研究費)(組合分担金を除く)",{"$nulls":17},"その他","合計"]
[{"$nulls":4},"特定財源 (市区町村分担金を除く)",{"$nulls":6},"一般財源",null,"特定財源 (市区町村分担金を除く)",{"$nulls":6},"一般財源",null,"特定財源 (市区町村分担金を除く)",{"$nulls":6},"一般財源","合計","工事費 (中間処理施設+最終処分場+その他)",{"$nulls":4},"調査費","（建設改良費組合分担金）","合計","人件費（一般職＋収集運搬＋中間処理＋最終処分）",{"$nulls":4},"処理費 (収集運搬費+中間処理費+最終処分費)",{"$nulls":3},"車両等購入費","委託費 (収集運搬費+中間処理費+最終処分費+その他)",{"$nulls":4},"(組合分担金)","調査研究費",null,null,"合計","工事費 (中間処理施設+最終処分場+その他)",{"$nulls":4},"調査費","（建設改良費組合分担金）","合計","人件費（一般職＋収集運搬＋中間処理＋最終処分）",{"$nulls":4},"処理費 (収集運搬費+中間処理費+最終処分費)",{"$nulls":3},"車両等購入費","委託費 (収集運搬費+中間処理費+最終処分費+その他)",{"$nulls":4},"(組合分担金)","調査研究費",null,null,"合計","工事費 (中間処理施設+最終処分場+その他)",{"$nulls":4},"調査費","（建設改良費組合分担金）","合計","人件費（一般職＋収集運搬＋中間処理＋最終処分）",{"$nulls":4},"処理費 (収集運搬費+中間処理費+最終処分費)",{"$nulls":3},"車両等購入費","委託費 (収集運搬費+中間処理費+最終処分費+その他)",{"$nulls":4},"(組合分担金)","調査研究費"]
[{"$nulls":4},"合計","国庫支出金","都道府県\n支出金","地方債","使用料及び\n手数料","（市区町村\n分担金）","その他",null,null,"合計","国庫支出金","都道府県\n支出金","地方債","使用料及び\n手数料","（市区町村\n分担金）","その他",null,null,"合計","国庫支出金","都道府県\n支出金","地方債","使用料及び\n手数料","（市区町村\n分担金）","その他",null,null,"合計","収集運搬施設","中間処理施設","最終処分場","その他",{"$nulls":3},"合計","一般職","収集運搬","中間処理","最終処分","合計","収集運搬費","中間処理費","最終処分費",null,"合計","収集運搬費","中間処理費","最終処分費","その他",{"$nulls":5},"合計","収集運搬施設","中間処理施設","最終処分場","その他",{"$nulls":3},"合計","一般職","収集運搬","中間処理","最終処分","合計","収集運搬費","中間処理費","最終処分費",null,"合計","収集運搬費","中間処理費","最終処分費","その他",{"$nulls":5},"合計","収集運搬施設","中間処理施設","最終処分場","その他",{"$nulls":3},"合計","一般職","収集運搬","中間処理","最終処分","合計","収集運搬費","中間処理費","最終処分費",null,"合計","収集運搬費","中間処理費","最終処分費","その他"]
[{"$nulls":3},"（千円）","（千円）","（千円）","（千円）","（千円）","（千円）","（千円）","（千円）","（千円）","（千円）","（千円）","（千円）","（千円）","（千円）","（千円）","（千円）","（千円）","（千円）","（千円）","（千円）","（千円）","（千円）","（千円）","（千円）","（千円）","（千円）","（千円）","（千円）","（千円）","（千円）","（千円）","（千円）","（千円）","（千円）","（千円）","（千円）","（千円）","（千円）","（千円）","（千円）","（千円）","（千円）","（千円）","（千円）","（千円）","（千円）","（千円）","（千円）","（千円）","（千円）","（千円）","（千円）","（千円）","（千円）","（千円）","（千円）","（千円）","（千円）","（千円）","（千円）","（千円）","（千円）","（千円）","（千円）","（千円）","（千円）","（千円）","（千円）","（千円）","（千円）","（千円）","（千円）","（千円）","（千円）","（千円）","（千円）","（千円）","（千円）","（千円）","（千円）","（千円）","（千円）","（千円）","（千円）","（千円）","（千円）","（千円）","（千円）","（千円）","（千円）","（千円）","（千円）","（千円）","（千円）","（千円）","（千円）","（千円）","（千円）","（千円）","（千円）","（千円）","（千円）","（千円）","（千円）","（千円）","（千円）","（千円）","（千円）","（千円）","（千円）","（千円）"]
{"$rows_left_out":9}
{"sheet":"廃棄物事業経費（歳入）","index":2,"n_rows":40,"n_cols":31,"rows_kept":40,"merged":[[1,0,5,0],[1,1,5,1],[1,2,5,2]]}
["廃棄物処理事業経費（市区町村及び一部事務組合・広域連合の合計）【歳入】（平成28年度実績）"]
["都道府県名","地方公共団体コード","市区町村・一部事務組合・広域連合名","ごみ",{"$nulls":8},"し尿",{"$nulls":8},"合計"]
[{"$nulls":3},"合計 (特定財源(市区町村分担金を除く)+一般財源)",{"$nulls":8},"合計 (特定財源(市区町村分担金を除く)+一般財源)",{"$nulls":8},"合計 (特定財源(市区町村分担金を除く)+一般財源)"]
[{"$nulls":4},"特定財源 (市区町村分担金を除く)",{"$nulls":6},"一般財源",null,"特定財源 (市区町村分担金を除く)",{"$nulls":6},"一般財源",null,"特定財源 (市区町村分担金を除く)",{"$nulls":6},"一般財源"]
[{"$nulls":4},"合計","国庫支出金","都道府県\n支出金","地方債","使用料及び\n手数料","（市区町村\n分担金）","その他",null,null,"合計","国庫支出金","都道府県\n支出金","地方債","使用料及び\n手数料","（市区町村\n分担金）","その他",null,null,"合計","国庫支出金","都道府県\n支出金","地方債","使用料及び\n手数料","（市区町村\n分担金）","その他"]
[{"$nulls":3},"（千円）","（千円）","（千円）","（千円）","（千円）","（千円）","（千円）","（千円）","（千円）","（千円）","（千円）","（千円）","（千円）","（千円）","（千円）","（千円）","（千円）","（千円）","（千円）","（千円）","（千円）","（千円）","（千円）","（千円）","（千円）","（千円）","（千円）"]
{"$rows_left_out":35}
{"sheet":"廃棄物事業経費（歳出）","index":3,"n_rows":40,"n_cols":87,"rows_kept":40,"merged":[[1,0,5,0],[1,1,5,1],[1,2,5,2],[3,10,4,10],[3,38,4,38],[3,66,4,66]]}
["廃棄物処理事業経費（市区町村及び一部事務組合・広域連合の合計）【歳出】（平成28年度実績）"]
["都道府県名","地方公共団体コード","市区町村・一部事務組合・広域連合名","ごみ（建設改良費＋処理維持管理費＋その他）（組合分担金を除く）",{"$nulls":27},"し尿（建設改良費＋処理維持管理費＋その他）（組合分担金を除く）",{"$nulls":27},"合計（建設改良費＋処理維持管理費＋その他）（組合分担金を除く）"]
[{"$nulls":3},"建設改良費 (工事費+調査費)(組合分担金を除く)",{"$nulls":7},"処理及び維持管理費 (人件費+処理費+車両購入費+委託費+調査研究費)(組合分担金を除く)",{"$nulls":17},"その他","合計","建設改良費 (工事費+調査費)(組合分担金を除く)",{"$nulls":7},"処理及び維持管理費 (人件費+処理費+車両購入費+委託費+調査研究費)(組合分担金を除く)",{"$nulls":17},"その他","合計","建設改良費 (工事費+調査費)(組合分担金を除く)",{"$nulls":7},"処理及び維持管理費 (人件費+処理費+車両購入費+委託費+調査研究費)(組合分担金を除く)",{"$nulls":17},"その他","合計"]
[{"$nulls":3},"合計","工事費 (中間処理施設+最終処分場+その他)",{"$nulls":4},"調査費","（建設改良費組合分担金）","合計","人件費（一般職＋収集運搬＋中間処理＋最終処分）",{"$nulls":4},"処理費 (収集運搬費+中間処理費+最終処分費)",{"$nulls":3},"車両等購入費","委託費 (収集運搬費+中間処理費+最終処分費+その他)",{"$nulls":4},"(組合分担金)","調査研究費",null,null,"合計","工事費 (中間処理施設+最終処分場+その他)",{"$nulls":4},"調査費","（建設改良費組合分担金）","合計","人件費（一般職＋収集運搬＋中間処理＋最終処分）",{"$nulls":4},"処理費 (収集運搬費+中間処理費+最終処分費)",{"$nulls":3},"車両等購入費","委託費 (収集運搬費+中間処理費+最終処分費+その他)",{"$nulls":4},"(組合分担金)","調査研究費",null,null,"合計","工事費 (中間処理施設+最終処分場+その他)",{"$nulls":4},"調査費","（建設改良費組合分担金）","合計","人件費（一般職＋収集運搬＋中間処理＋最終処分）",{"$nulls":4},"処理費 (収集運搬費+中間処理費+最終処分費)",{"$nulls":3},"車両等購入費","委託費 (収集運搬費+中間処理費+最終処分費+その他)",{"$nulls":4},"(組合分担金)","調査研究費"]
[{"$nulls":4},"合計","収集運搬施設","中間処理施設","最終処分場","その他",{"$nulls":3},"合計","一般職","収集運搬","中間処理","最終処分","合計","収集運搬費","中間処理費","最終処分費",null,"合計","収集運搬費","中間処理費","最終処分費","その他",{"$nulls":5},"合計","収集運搬施設","中間処理施設","最終処分場","その他",{"$nulls":3},"合計","一般職","収集運搬","中間処理","最終処分","合計","収集運搬費","中間処理費","最終処分費",null,"合計","収集運搬費","中間処理費","最終処分費","その他",{"$nulls":5},"合計","収集運搬施設","中間処理施設","最終処分場","その他",{"$nulls":3},"合計","一般職","収集運搬","中間処理","最終処分","合計","収集運搬費","中間処理費","最終処分費",null,"合計","収集運搬費","中間処理費","最終処分費","その他"]
[{"$nulls":3},"（千円）","（千円）","（千円）","（千円）","（千円）","（千円）","（千円）","（千円）","（千円）","（千円）","（千円）","（千円）","（千円）","（千円）","（千円）","（千円）","（千円）","（千円）","（千円）","（千円）","（千円）","（千円）","（千円）","（千円）","（千円）","（千円）","（千円）","（千円）","（千円）","（千円）","（千円）","（千円）","（千円）","（千円）","（千円）","（千円）","（千円）","（千円）","（千円）","（千円）","（千円）","（千円）","（千円）","（千円）","（千円）","（千円）","（千円）","（千円）","（千円）","（千円）","（千円）","（千円）","（千円）","（千円）","（千円）","（千円）","（千円）","（千円）","（千円）","（千円）","（千円）","（千円）","（千円）","（千円）","（千円）","（千円）","（千円）","（千円）","（千円）","（千円）","（千円）","（千円）","（千円）","（千円）","（千円）","（千円）","（千円）","（千円）","（千円）","（千円）","（千円）","（千円）","（千円）","（千円）"]
{"$rows_left_out":35}
{"sheet":"組合分担金内訳","index":4,"n_rows":33,"n_cols":57,"rows_kept":33,"merged":[[1,0,5,0],[1,1,5,1],[1,2,5,2],[3,9,5,9],[3,10,5,10],[3,17,5,17],[3,18,5,18],[3,25,5,25],[3,26,5,26],[3,33,5,33],[3,34,5,34],[3,41,5,41],[3,42,5,42],[3,49,5,49],[3,50,5,50]]}
["廃棄物処理事業経費【分担金の合計】（平成28年度実績）"]
["都道府県名","地方公共団体コード","市区町村名","合計（広域団体１+広域団体２+広域団体３+広域団体４+広域団体５+広域団体６）",{"$nulls":5},"広域団体１",{"$nulls":7},"広域団体２",{"$nulls":7},"広域団体３",{"$nulls":7},"広域団体４",{"$nulls":7},"広域団体５",{"$nulls":7},"広域団体６"]
[]
[{"$nulls":3},"ごみ",null,null,"し尿",null,null,"広域団体コード","一部事務組合・広域連合名","ごみ",null,null,"し尿",null,null,"広域団体コード","一部事務組合・広域連合名","ごみ",null,null,"し尿",null,null,"広域団体コード","一部事務組合・広域連合名","ごみ",null,null,"し尿",null,null,"広域団体コード","一部事務組合・広域連合名","ごみ",null,null,"し尿",null,null,"広域団体コード","一部事務組合・広域連合名","ごみ",null,null,"し尿",null,null,"広域団体コード","一部事務組合・広域連合名","ごみ",null,null,"し尿"]
[{"$nulls":3},"建設・改良費","処理及び\n維持管理費","合計","建設・改良費","処理及び\n維持管理費","合計",null,null,"建設・改良費","処理及び\n維持管理費","小計","建設・改良費","処理及び\n維持管理費","小計",null,null,"建設・改良費","処理及び\n維持管理費","小計","建設・改良費","処理及び\n維持管理費","小計",null,null,"建設・改良費","処理及び\n維持管理費","小計","建設・改良費","処理及び\n維持管理費","小計",null,null,"建設・改良費","処理及び\n維持管理費","小計","建設・改良費","処理及び\n維持管理費","小計",null,null,"建設・改良費","処理及び\n維持管理費","小計","建設・改良費","処理及び\n維持管理費","小計",null,null,"建設・改良費","処理及び\n維持管理費","小計","建設・改良費","処理及び\n維持管理費","小計"]
[{"$nulls":3},"（千円）","（千円）","（千円）","（千円）","（千円）","（千円）",null,null,"（千円）","（千円）","（千円）","（千円）","（千円）","（千円）",null,null,"（千円）","（千円）","（千円）","（千円）","（千円）","（千円）",null,null,"（千円）","（千円）","（千円）","（千円）","（千円）","（千円）",null,null,"（千円）","（千円）","（千円）","（千円）","（千円）","（千円）",null,null,"（千円）","（千円）","（千円）","（千円）","（千円）","（千円）",null,null,"（千円）","（千円）","（千円）","（千円）","（千円）","（千円）"]
{"$rows_left_out":28}
{"sheet":"市町村分担金内訳","index":5,"n_rows":14,"n_cols":125,"rows_kept":14,"merged":[[1,0,5,0],[1,1,5,1],[1,2,5,2],[1,3,2,4],[3,3,4,3],[3,4,4,4],[3,5,5,5],[3,6,5,6],[3,7,4,7],[3,8,4,8],[3,9,5,9],[3,10,5,10],[3,11,4,11],[3,12,4,12],[3,13,5,13],[3,14,5,14],[3,15,4,15],[3,16,4,16],[3,17,5,17],[3,18,5,18],[3,19,4,19],[3,20,4,20],[3,21,5,21],[3,22,5,22],[3,23,4,23],[3,24,4,24],[3,25,5,25],[3,26,5,26],[3,27,4,27],[3,28,4,28],[3,29,5,29],[3,30,5,30],[3,31,4,31],[3,32,4,32],[3,33,5,33],[3,34,5,34],[3,35,4,35],[3,36,4,36],[3,37,5,37],[3,38,5,38],[3,39,4,39],[3,40,4,40],[3,41,5,41],[3,42,5,42],[3,43,4,43],[3,44,4,44],[3,45,5,45],[3,46,5,46],[3,47,4,47],[3,48,4,48],[3,49,5,49],[3,50,5,50],[3,51,4,51],[3,52,4,52],[3,53,5,53],[3,54,5,54],[3,55,4,55],[3,56,4,56],[3,57,5,57],[3,58,5,58],[3,59,4,59],[3,60,4,60],[3,61,5,61],[3,62,5,62],[3,63,4,63],[3,64,4,64],[3,65,5,65],[3,66,5,66],[3,67,4,67],[3,68,4,68],[3,69,5,69],[3,70,5,70],[3,71,4,71],[3,72,4,72],[3,73,5,73],[3,74,5,74],[3,75,4,75],[3,76,4,76],[3,77,5,77],[3,78,5,78],[3,79,4,79],[3,80,4,80],[3,81,5,81],[3,82,5,82],[3,83,4,83],[3,84,4,84],[3,85,5,85],[3,86,5,86],[3,87,4,87],[3,88,4,88],[3,89,5,89],[3,90,5,90],[3,91,4,91],[3,92,4,92],[3,93,5,93],[3,94,5,94],[3,95,4,95],[3,96,4,96],[3,97,5,97],[3,98,5,98],[3,99,4,99],[3,100,4,100],[3,101,5,101],[3,102,5,102],[3,103,4,103],[3,104,4,104],[3,105,5,105],[3,106,5,106],[3,107,4,107],[3,108,4,108],[3,109,5,109],[3,110,5,110],[3,111,4,111],[3,112,4,112],[3,113,5,113],[3,114,5,114],[3,115,4,115],[3,116,4,116],[3,117,5,117],[3,118,5,118],[3,119,4,119],[3,120,4,120],[3,121,5,121],[3,122,5,122],[3,123,4,123],[3,124,4,124]]}
["廃棄物処理事業経費【市区町村分担金の合計（平成28年度実績）"]
["都道府県名","地方公共団体コード","一部事務組合・広域連合名","合計（構成市区町村1+～+構成市区町村30）",null,"構成市区町村1",{"$nulls":3},"構成市区町村2",{"$nulls":3},"構成市区町村3",{"$nulls":3},"構成市区町村4",{"$nulls":3},"構成市区町村5",{"$nulls":3},"構成市区町村6",{"$nulls":3},"構成市区町村7",{"$nulls":3},"構成市区町村8",{"$nulls":3},"構成市区町村9",{"$nulls":3},"構成市区町村10",{"$nulls":3},"構成市区町村11",{"$nulls":3},"構成市区町村12",{"$nulls":3},"構成市区町村13",{"$nulls":3},"構成市区町村14",{"$nulls":3},"構成市区町村15",{"$nulls":3},"構成市区町村16",{"$nulls":3},"構成市区町村17",{"$nulls":3},"構成市区町村18",{"$nulls":3},"構成市区町村19",{"$nulls":3},"構成市区町村20",{"$nulls":3},"構成市区町村21",{"$nulls":3},"構成市区町村22",{"$nulls":3},"構成市区町村23",{"$nulls":3},"構成市区町村24",{"$nulls":3},"構成市区町村25",{"$nulls":3},"構成市区町村26",{"$nulls":3},"構成市区町村27",{"$nulls":3},"構成市区町村28",{"$nulls":3},"構成市区町村29",{"$nulls":3},"構成市区町村30"]
[]
[{"$nulls":3},"ごみ","し尿","市区町村\nコード","市区町村名","ごみ","し尿","市区町村\nコード","市区町村名","ごみ","し尿","市区町村\nコード","市区町村名","ごみ","し尿","市区町村\nコード","市区町村名","ごみ","し尿","市区町村\nコード","市区町村名","ごみ","し尿","市区町村\nコード","市区町村名","ごみ","し尿","市区町村\nコード","市区町村名","ごみ","し尿","市区町村\nコード","市区町村名","ごみ","し尿","市区町村\nコード","市区町村名","ごみ","し尿","市区町村\nコード","市区町村名","ごみ","し尿","市区町村\nコード","市区町村名","ごみ","し尿","市区町村\nコード","市区町村名","ごみ","し尿","市区町村\nコード","市区町村名","ごみ","し尿","市区町村\nコード","市区町村名","ごみ","し尿","市区町村\nコード","市区町村名","ごみ","し尿","市区町村\nコード","市区町村名","ごみ","し尿","市区町村\nコード","市区町村名","ごみ","し尿","市区町村\nコード","市区町村名","ごみ","し尿","市区町村\nコード","市区町村名","ごみ","し尿","市区町村\nコード","市区町村名","ごみ","し尿","市区町村\nコード","市区町村名","ごみ","し尿","市区町村\nコード","市区町村名","ごみ","し尿","市区町村\nコード","市区町村名","ごみ","し尿","市区町村\nコード","市区町村名","ごみ","し尿","市区町村\nコード","市区町村名","ごみ","し尿","市区町村\nコード","市区町村名","ごみ","し尿","市区町村\nコード","市区町村名","ごみ","し尿","市区町村\nコード","市区町村名","ごみ","し尿","市区町村\nコード","市区町村名","ごみ","し尿","市区町村\nコード","市区町村名","ごみ","し尿"]
[]
[{"$nulls":3},"（千円）","（千円）",null,null,"（千円）","（千円）",null,null,"（千円）","（千円）",null,null,"（千円）","（千円）",null,null,"（千円）","（千円）",null,null,"（千円）","（千円）",null,null,"（千円）","（千円）",null,null,"（千円）","（千円）",null,null,"（千円）","（千円）",null,null,"（千円）","（千円）",null,null,"（千円）","（千円）",null,null,"（千円）","（千円）",null,null,"（千円）","（千円）",null,null,"（千円）","（千円）",null,null,"（千円）","（千円）",null,null,"（千円）","（千円）",null,null,"（千円）","（千円）",null,null,"（千円）","（千円）",null,null,"（千円）","（千円）",null,null,"（千円）","（千円）",null,null,"（千円）","（千円）",null,null,"（千円）","（千円）",null,null,"（千円）","（千円）",null,null,"（千円）","（千円）",null,null,"（千円）","（千円）",null,null,"（千円）","（千円）",null,null,"（千円）","（千円）",null,null,"（千円）","（千円）",null,null,"（千円）","（千円）",null,null,"（千円）","（千円）",null,null,"（千円）","（千円）"]
{"$rows_left_out":9}
{"sheet":"経費集計","index":6,"n_rows":250,"n_cols":38,"rows_kept":250,"merged":[[5,1,5,3],[5,7,5,10],[6,1,6,3],[6,7,13,7],[6,8,9,8],[6,9,6,10],[7,1,7,3],[7,9,7,10],[8,1,8,3],[8,9,8,10],[9,1,9,3],[9,9,9,10],[10,1,10,3],[10,8,10,10],[11,1,11,3],[11,8,11,10],[12,1,12,3],[12,8,12,10],[13,2,13,3],[14,1,14,3],[14,7,29,7],[14,8,17,8],[15,1,15,3],[15,9,17,9],[16,2,16,3],[18,8,20,8],[18,9,18,10],[19,1,19,3],[19,9,19,10],[20,1,20,3],[20,9,20,10],[21,8,21,10],[22,8,25,8],[22,9,22,10],[23,9,23,10],[24,9,24,10],[25,9,25,10],[26,8,26,10],[27,8,27,10],[28,8,28,10],[30,7,30,10],[31,7,31,10]]}
[null,{"$f":"COUNTA(A:A) - 3","v":-3},{"$f":"SUBTOTAL(3,A:A ) - 2","v":-2}]
[null,null,"入力→",null,":市区町村コード(都道府県計は、01000～47000の何れか）",{"$nulls":6},{"$f":"LEFT(D2,2)","v":""},{"$f":"IF(L2<>\"\",VLOOKUP(L2,$AK$6:$AL$52,2,FALSE),\"-\")","v":"-"},{"$nulls":15},{"$f":"IF(VALUE(D2)=0,0,1)","v":0},{"$f":"IF(AC2=0,\"\",VLOOKUP(D2,'廃棄物事業経費（歳入）'!B7:C250,2,FALSE))","v":""},null,{"$f":"IF(AC2=0,1,IF(ISERROR(AD2),1,0))","v":1},null,"=COUNTA('廃棄物事業経費（歳入）'!B7:B250)+6",{"$f":"IF(AC2=0,0,VLOOKUP(D2,AH5:AI250,2,FALSE))","v":0}]
[]
[]
[{"$nulls":12},"（千円）",{"$nulls":20},{"$f":"+'廃棄物事業経費（歳入）'!B5","v":0},5]
[null,"歳入",null,null,"ごみ","し尿",null,"歳出",{"$nulls":3},"ごみ","し尿",{"$nulls":20},{"$f":"+'廃棄物事業経費（歳入）'!B6","v":0},6,null,"01","北海道"]
{"$rows_left_out":244}