{"text_format":"3","workbook":"xlsx","n_sheets":9,"sheets":["ごみ処理概要","ごみ搬入量内訳","施設区分別搬入量内訳","ごみ処理量内訳","資源化量内訳","施設資源化量内訳","災害廃棄物搬入量","ごみ集計結果","ごみフローシート"],"not_rendered":{"defined_names":17},"read":"whole","date_system":"1900"}

{"sheet":"ごみ処理概要","index":0,"n_rows":51,"n_cols":43,"rows_kept":51,"merged":[[1,0,5,0],[1,1,5,1],[1,2,5,2],[1,3,1,4],[1,7,1,10],[1,11,1,13],[1,14,3,14],[1,27,4,27],[1,28,1,35],[1,36,4,36],[1,37,4,37],[1,38,1,41],[2,4,3,4],[2,5,3,5],[2,7,3,7],[2,8,3,8],[2,9,3,9],[2,10,3,10],[2,11,4,11],[2,12,4,12],[2,13,4,13],[2,15,3,15],[2,16,3,16],[2,17,2,24],[2,25,3,25],[2,26,3,26],[2,28,3,28],[2,29,3,29],[2,30,3,30],[2,31,3,31],[2,32,3,32],[2,33,3,33],[2,34,3,34],[2,35,3,35],[2,38,3,38],[2,39,3,39],[2,40,3,40],[2,41,3,41],[3,17,4,17],[3,18,4,18],[3,19,4,19],[3,20,4,20],[3,21,4,21],[3,22,4,22],[3,23,4,23],[3,24,4,24]]}
["ごみ処理の概要（平成28年度実績）"]
["都道府県名","地方公共団体コード","市区町村名","総人口",null,null,"外国人人口","ごみ総排出量 (計画収集量+直接搬入量+集団回収量)",{"$nulls":3},"１人１日当たりの排出量",null,null,"自家処理量","ごみ処理量 (直接焼却量+直接最終処分量+焼却以外の中間処理量+直接資源化量)",{"$nulls":11},"減量処理率 (直接資源化量+直接焼却量+焼却以外の中間処理量)/ごみ処理量*100\n\n","中間処理後再生利用量 (焼却施設＋粗大ごみ処理施設+ごみ堆肥化施設+ごみ飼料化施設+メタン化施設+ごみ燃料化施設+その他の資源化等を行う施設+その他の施設)",{"$nulls":7},"リサイクル率 Ｒ\n(直接資源化量+中間処理後再生利用量+集団回収量)/(ごみ処理量+集団回収量)*100","リサイクル率 Ｒ’\n(直接資源化量+中間処理後再生利用量〔固形燃料、焼却灰・飛灰のｾﾒﾝﾄ原料化、セメント等への直接投入、飛灰の山元還元　を除く〕+集団回収量)/(ごみ処理量+集団回収量)*100","最終処分量 (直接最終処分量+焼却残渣量+処理残渣量)"]
[{"$nulls":4},"計画収集人口","自家処理人口",null,"計画収集量","直接搬入量","集団回収量","合計","合計\n(ごみ総排出量)*10^6/総人口/365","生活系ごみ\n(生活系ごみ搬入量+集団回収量)*10^6/総人口/365","事業系ごみ\n(事業系ごみ搬入量)*10^6/総人口/365",null,"直接焼却量","直接最終\n処分量","焼却以外の中間処理量(粗大ごみ処理施設+ごみ堆肥化施設+ごみ飼料化施設+メタン化施設+ごみ燃料化施設+その他の資源化等を行う施設+その他の施設)",{"$nulls":7},"直接\n資源化量","合計",null,"焼却施設","粗大ごみ\n処理施設","ごみ堆肥化施設","ごみ飼料化施設","メタン化施設","ごみ燃料化施設","その他の資源化等を行う施設","合計",null,null,"直接最終\n処分量","焼却残渣量","処理残渣量","合計"]
[{"$nulls":17},"合計","粗大ごみ\n処理施設","資源化等を行う施設","ごみ堆肥化施設","ごみ飼料化施設","メタン化施設","ごみ燃料化\n施設","その他の\n施設"]
[]
[{"$nulls":3},"（人）","（人）","（人）","（人）","（ｔ）","（ｔ）","（ｔ）","（ｔ）","（g/人日)","（g/人日)","（g/人日)","（ｔ）","（ｔ）","（ｔ）","（ｔ）","（ｔ）","（ｔ）","（ｔ）","（ｔ）","（ｔ）","（ｔ）","（ｔ）","（ｔ）","（ｔ）","（％）","（ｔ）","（ｔ）","（ｔ）","（ｔ）","（ｔ）","（ｔ）","（ｔ）","（ｔ）","（％）","（％）","（ｔ）","（ｔ）","（ｔ）","（ｔ）"]
{"$rows_left_out":46}
{"sheet":"ごみ搬入量内訳","index":1,"n_rows":51,"n_cols":117,"rows_kept":51,"merged":[[1,0,5,0],[1,1,5,1],[1,2,5,2],[2,112,3,112],[2,113,3,113],[2,114,3,114],[2,115,3,115],[2,116,3,116],[3,5,3,8],[3,9,3,12],[3,13,3,16],[3,17,3,20],[3,21,3,24],[3,25,3,28],[3,30,3,33],[3,34,3,37],[3,38,3,41],[3,42,3,45],[3,46,3,49],[3,50,3,53]]}
["ごみ搬入量の状況（平成28年度実績）"]
["都道府県名","地方公共団体コード","市区町村名","ごみ搬入量 (生活系ごみ収集量+事業系ごみ収集量+直接搬入量)",{"$nulls":65},"生活系ごみ搬入量",{"$nulls":20},"事業系ごみ搬入量",{"$nulls":20},"自家処理量","家電４品目収集量(直営+委託+許可+直接搬入)"]
[{"$nulls":4},"生活系ごみ収集量 (混合ごみ+可燃ごみ+不燃ごみ+資源ごみ+その他+粗大ごみ)",{"$nulls":24},"事業系ごみ収集量 (混合ごみ+可燃ごみ+不燃ごみ+資源ごみ+その他+粗大ごみ)",{"$nulls":24},"直接搬入量",{"$nulls":15},"生活系ごみ収集量＋直接搬入量",{"$nulls":20},"事業系ごみ収集量＋直接搬入量",{"$nulls":20},"合計","直営","委託","許可","直接搬入"]
[{"$nulls":5},"混合ごみ (直営+委託+許可)",{"$nulls":3},"可燃ごみ (直営+委託+許可)",{"$nulls":3},"不燃ごみ (直営+委託+許可)",{"$nulls":3},"資源ごみ (直営+委託+許可)",{"$nulls":3},"その他のごみ (直営+委託+許可)",{"$nulls":3},"粗大ごみ (直営+委託+許可)",{"$nulls":4},"混合ごみ (直営+委託+許可)",{"$nulls":3},"可燃ごみ (直営+委託+許可)",{"$nulls":3},"不燃ごみ (直営+委託+許可)",{"$nulls":3},"資源ごみ (直営+委託+許可)",{"$nulls":3},"その他のごみ (直営+委託+許可)",{"$nulls":3},"粗大ごみ (直営+委託+許可)",{"$nulls":4},"直接搬入量（生活系ごみ）",{"$nulls":6},"直接搬入量（事業系ごみ）",{"$nulls":13},"生活系ごみ収集量 (混合ごみ+可燃ごみ+不燃ごみ+資源ごみ+その他+粗大ごみ)",{"$nulls":6},"直接搬入量(混合ごみ+可燃ごみ+不燃ごみ+資源ごみ+その他+粗大ごみ)",{"$nulls":13},"事業系ごみ収集量 (混合ごみ+可燃ごみ+不燃ごみ+資源ごみ+その他+粗大ごみ)",{"$nulls":6},"直接搬入量(混合ごみ+可燃ごみ+不燃ごみ+資源ごみ+その他+粗大ごみ)"]
[{"$nulls":3},"合計","合計","合計","直営","委託","許可","合計","直営","委託","許可","合計","直営","委託","許可","合計","直営","委託","許可","合計","直営","委託","許可","合計","直営","委託","許可","合計","合計","直営","委託","許可","合計","直営","委託","許可","合計","直営","委託","許可","合計","直営","委託","許可","合計","直営","委託","許可","合計","直営","委託","許可","合計","合計","混合ごみ","可燃ごみ","不燃ごみ","資源ごみ","その他のごみ","粗大ごみ","合計","混合ごみ","可燃ごみ","不燃ごみ","資源ごみ","その他のごみ","粗大ごみ","合計","混合ごみ","可燃ごみ","不燃ごみ","資源ごみ","その他のごみ","粗大ごみ","合計","混合ごみ","可燃ごみ","不燃ごみ","資源ごみ","その他のごみ","粗大ごみ","合計","混合ごみ","可燃ごみ","不燃ごみ","資源ごみ","その他のごみ","粗大ごみ","合計","混合ごみ","可燃ごみ","不燃ごみ","資源ごみ","その他のごみ","粗大ごみ","合計","混合ごみ","可燃ごみ","不燃ごみ","資源ごみ","その他のごみ","粗大ごみ","合計","混合ごみ","可燃ごみ","不燃ごみ","資源ごみ","その他のごみ","粗大ごみ"]
[{"$nulls":3},"（ｔ）","（ｔ）","（ｔ）","（ｔ）","（ｔ）","（ｔ）","（ｔ）","（ｔ）","（ｔ）","（ｔ）","（ｔ）","（ｔ）","（ｔ）","（ｔ）","（ｔ）","（ｔ）","（ｔ）","（ｔ）","（ｔ）","（ｔ）","（ｔ）","（ｔ）","（ｔ）","（ｔ）","（ｔ）","（ｔ）","（ｔ）","（ｔ）","（ｔ）","（ｔ）","（ｔ）","（ｔ）","（ｔ）","（ｔ）","（ｔ）","（ｔ）","（ｔ）","（ｔ）","（ｔ）","（ｔ）","（ｔ）","（ｔ）","（ｔ）","（ｔ）","（ｔ）","（ｔ）","（ｔ）","（ｔ）","（ｔ）","（ｔ）","（ｔ）","（ｔ）","（ｔ）","（ｔ）","（ｔ）","（ｔ）","（ｔ）","（ｔ）","（ｔ）","（ｔ）","（ｔ）","（ｔ）","（ｔ）","（ｔ）","（ｔ）","（ｔ）","（ｔ）","（ｔ）","（ｔ）","（ｔ）","（ｔ）","（ｔ）","（ｔ）","（ｔ）","（ｔ）","（ｔ）","（ｔ）","（ｔ）","（ｔ）","（ｔ）","（ｔ）","（ｔ）","（ｔ）","（ｔ）","（ｔ）","（ｔ）","（ｔ）","（ｔ）","（ｔ）","（ｔ）","（ｔ）","（ｔ）","（ｔ）","（ｔ）","（ｔ）","（ｔ）","（ｔ）","（ｔ）","（ｔ）","（ｔ）","（ｔ）","（ｔ）","（ｔ）","（ｔ）","（ｔ）","（ｔ）","（ｔ）","（ｔ）","（ｔ）","(t)","（ｔ）","（ｔ）","（ｔ）","（ｔ）"]
{"$rows_left_out":46}
{"sheet":"施設区分別搬入量内訳","index":2,"n_rows":51,"n_cols":144,"rows_kept":51,"merged":[[1,0,5,0],[1,1,5,1],[1,2,5,2]]}
["処理施設別ごみ搬入量の状況（平成28年度実績）"]
["都道府県名","地方公共団体コード","市区町村名","処理施設別のごみ搬入量(処理施設+直接資源化+直接埋立)"]
[{"$nulls":4},"焼却施設（収集ごみ＋直接搬入ごみ）",{"$nulls":14},"粗大ごみ処理施設（収集ごみ＋直接搬入ごみ）",{"$nulls":14},"ごみ堆肥化施設（収集ごみ＋直接搬入ごみ）",{"$nulls":14},"ごみ飼料化施設（収集ごみ＋直接搬入ごみ）",{"$nulls":14},"メタン化施設（収集ごみ＋直接搬入ごみ）",{"$nulls":14},"ごみ燃料化施設（収集ごみ＋直接搬入ごみ）",{"$nulls":14},"その他の資源化等を行う施設（収集ごみ＋直接搬入ごみ）　＋　セメント等への直接投入（収集ごみ＋直接搬入ごみ）",{"$nulls":14},"その他の施設（収集ごみ＋直接搬入ごみ）",{"$nulls":14},"直接資源化（収集ごみ＋直接搬入ごみ）",{"$nulls":4},"直接埋立（収集ごみ＋直接搬入ごみ）"]
[{"$nulls":5},"収集ごみ (混合ごみ+可燃ごみ+不燃ごみ+資源ごみ+その他+粗大ごみ)",{"$nulls":6},"直接搬入ごみ (混合ごみ+可燃ごみ+不燃ごみ+資源ごみ+その他+粗大ごみ)",{"$nulls":7},"収集ごみ (混合ごみ+可燃ごみ+不燃ごみ+資源ごみ+その他+粗大ごみ)",{"$nulls":6},"直接搬入ごみ (混合ごみ+可燃ごみ+不燃ごみ+資源ごみ+その他+粗大ごみ)",{"$nulls":7},"収集ごみ (混合ごみ+可燃ごみ+不燃ごみ+資源ごみ+その他+粗大ごみ)",{"$nulls":6},"直接搬入ごみ (混合ごみ+可燃ごみ+不燃ごみ+資源ごみ+その他+粗大ごみ)",{"$nulls":7},"収集ごみ (混合ごみ+可燃ごみ+不燃ごみ+資源ごみ+その他+粗大ごみ)",{"$nulls":6},"直接搬入ごみ (混合ごみ+可燃ごみ+不燃ごみ+資源ごみ+その他+粗大ごみ)",{"$nulls":7},"収集ごみ (混合ごみ+可燃ごみ+不燃ごみ+資源ごみ+その他+粗大ごみ)",{"$nulls":6},"直接搬入ごみ (混合ごみ+可燃ごみ+不燃ごみ+資源ごみ+その他+粗大ごみ)",{"$nulls":7},"収集ごみ (混合ごみ+可燃ごみ+不燃ごみ+資源ごみ+その他+粗大ごみ)",{"$nulls":6},"直接搬入ごみ (混合ごみ+可燃ごみ+不燃ごみ+資源ごみ+その他+粗大ごみ)",{"$nulls":7},"収集ごみ (混合ごみ+可燃ごみ+不燃ごみ+資源ごみ+その他+粗大ごみ)",{"$nulls":6},"直接搬入ごみ (混合ごみ+可燃ごみ+不燃ごみ+資源ごみ+その他+粗大ごみ)",{"$nulls":7},"収集ごみ (混合ごみ+可燃ごみ+不燃ごみ+資源ごみ+その他+粗大ごみ)",{"$nulls":6},"直接搬入ごみ (混合ごみ+可燃ごみ+不燃ごみ+資源ごみ+その他+粗大ごみ)",{"$nulls":7},"収集ごみ",null,"直接搬入ごみ",null,null,"収集ごみ (混合ごみ+可燃ごみ+不燃ごみ+資源ごみ+その他+粗大ごみ)",{"$nulls":6},"直接搬入ごみ (混合ごみ+可燃ごみ+不燃ごみ+資源ごみ+その他+粗大ごみ)"]
[{"$nulls":3},"合計","合計","合計","混合ごみ","可燃ごみ","不燃ごみ","資源ごみ","その他","粗大ごみ","合計","混合ごみ","可燃ごみ","不燃ごみ","資源ごみ","その他","粗大ごみ","合計","合計","混合ごみ","可燃ごみ","不燃ごみ","資源ごみ","その他","粗大ごみ","合計","混合ごみ","可燃ごみ","不燃ごみ","資源ごみ","その他","粗大ごみ","合計","合計","混合ごみ","可燃ごみ","不燃ごみ","資源ごみ","その他","粗大ごみ","合計","混合ごみ","可燃ごみ","不燃ごみ","資源ごみ","その他","粗大ごみ","合計","合計","混合ごみ","可燃ごみ","不燃ごみ","資源ごみ","その他","粗大ごみ","合計","混合ごみ","可燃ごみ","不燃ごみ","資源ごみ","その他","粗大ごみ","合計","合計","混合ごみ","可燃ごみ","不燃ごみ","資源ごみ","その他","粗大ごみ","合計","混合ごみ","可燃ごみ","不燃ごみ","資源ごみ","その他","粗大ごみ","合計","合計","混合ごみ","可燃ごみ","不燃ごみ","資源ごみ","その他","粗大ごみ","合計","混合ごみ","可燃ごみ","不燃ごみ","資源ごみ","その他","粗大ごみ","合計","合計","混合ごみ","可燃ごみ","不燃ごみ","資源ごみ","その他","粗大ごみ","合計","混合ごみ","可燃ごみ","不燃ごみ","資源ごみ","その他","粗大ごみ","合計","合計","混合ごみ","可燃ごみ","不燃ごみ","資源ごみ","その他","粗大ごみ","合計","混合ごみ","可燃ごみ","不燃ごみ","資源ごみ","その他","粗大ごみ","合計","資源ごみ","その他","資源ごみ","その他","合計","合計","混合ごみ","可燃ごみ","不燃ごみ","資源ごみ","その他","粗大ごみ","合計","混合ごみ","可燃ごみ","不燃ごみ","資源ごみ","その他","粗大ごみ"]
[{"$nulls":3},"（ｔ）","（ｔ）","（ｔ）","（ｔ）","（ｔ）","（ｔ）","（ｔ）","（ｔ）","（ｔ）","（ｔ）","（ｔ）","（ｔ）","（ｔ）","（ｔ）","（ｔ）","（ｔ）","（ｔ）","（ｔ）","（ｔ）","（ｔ）","（ｔ）","（ｔ）","（ｔ）","（ｔ）","（ｔ）","（ｔ）","（ｔ）","（ｔ）","（ｔ）","（ｔ）","（ｔ）","（ｔ）","（ｔ）","（ｔ）","（ｔ）","（ｔ）","（ｔ）","（ｔ）","（ｔ）","（ｔ）","（ｔ）","（ｔ）","（ｔ）","（ｔ）","（ｔ）","（ｔ）","（ｔ）","（ｔ）","（ｔ）","（ｔ）","（ｔ）","（ｔ）","（ｔ）","（ｔ）","（ｔ）","（ｔ）","（ｔ）","（ｔ）","（ｔ）","（ｔ）","（ｔ）","（ｔ）","（ｔ）","（ｔ）","（ｔ）","（ｔ）","（ｔ）","（ｔ）","（ｔ）","（ｔ）","（ｔ）","（ｔ）","（ｔ）","（ｔ）","（ｔ）","（ｔ）","（ｔ）","（ｔ）","（ｔ）","（ｔ）","（ｔ）","（ｔ）","（ｔ）","（ｔ）","（ｔ）","（ｔ）","（ｔ）","（ｔ）","（ｔ）","（ｔ）","（ｔ）","（ｔ）","（ｔ）","（ｔ）","（ｔ）","（ｔ）","（ｔ）","（ｔ）","（ｔ）","（ｔ）","（ｔ）","（ｔ）","（ｔ）","（ｔ）","（ｔ）","（ｔ）","（ｔ）","（ｔ）","（ｔ）","（ｔ）","（ｔ）","（ｔ）","（ｔ）","（ｔ）","（ｔ）","（ｔ）","（ｔ）","（ｔ）","（ｔ）","（ｔ）","（ｔ）","（ｔ）","（ｔ）","（ｔ）","（ｔ）","（ｔ）","（ｔ）","（ｔ）","（ｔ）","（ｔ）","（ｔ）","（ｔ）","（ｔ）","（ｔ）","（ｔ）","（ｔ）","（ｔ）","（ｔ）","（ｔ）","（ｔ）","（ｔ）"]
{"$rows_left_out":46}
{"sheet":"ごみ処理量内訳","index":3,"n_rows":51,"n_cols":45,"rows_kept":51,"merged":[[1,0,5,0],[1,1,5,1],[1,2,5,2],[2,3,4,3],[2,4,4,4],[2,5,2,12],[2,13,4,13],[2,14,4,14],[2,15,4,15],[2,16,4,16],[2,17,2,24],[2,25,4,25],[2,26,4,26],[2,27,4,27],[2,36,4,36],[2,37,4,37],[2,38,4,38],[2,39,4,39],[2,40,4,40],[2,41,4,41],[2,42,4,42],[2,43,4,43],[2,44,4,44],[3,5,4,5],[3,6,4,6],[3,7,4,7],[3,8,4,8],[3,9,4,9],[3,10,4,10],[3,11,4,11],[3,12,4,12],[3,17,4,17],[3,18,4,18],[3,19,4,19],[3,20,4,20],[3,21,4,21],[3,22,4,22],[3,23,4,23],[3,24,4,24],[3,28,4,28],[3,29,4,29],[3,30,4,30],[3,31,4,31],[3,32,4,32],[3,33,4,33],[3,34,4,34],[3,35,4,35]]}
["ごみ処理の状況（平成28年度実績）"]
["都道府県名","地方公共団体コード","市区町村名","処理量（直接焼却量+焼却以外の中間処理量+直接最終処分量+直接資源化量)",{"$nulls":11},"焼却処理量 (直接焼却量+焼却施設以外の中間処理施設からの搬入量)",{"$nulls":9},"最終処分量 (直接最終処分量+焼却残渣量+焼却施設以外の中間処理施設からの残渣量)",{"$nulls":10},"処理残渣保管量"]
[{"$nulls":3},"合計","直接焼却量","焼却以外の中間処理量 (粗大ごみ処理施設+ごみ堆肥化施設+ごみ飼料化施設+メタン化施設+ごみ燃料化施設+その他の資源化等を行う施設+その他の施設)",{"$nulls":7},"直接\n最終処分量","直接\n資源化量 ","合計","直接焼却量","焼却施設以外の中間処理施設からの搬入量",{"$nulls":7},"合計","直接最終\n処分量","焼却残渣量","焼却施設以外の中間処理施設からの残渣量",{"$nulls":7},"合計","焼却処理残渣の保管量","粗大ごみ\n処理施設","ごみ堆肥化施設","ごみ飼料化施設","メタン化施設","ごみ燃料化\n施設","その他の資源化等を行う施設","その他の\n施設"]
[{"$nulls":5},"合計","粗大ごみ\n処理施設","ごみ堆肥化施設","ごみ飼料化施設","メタン化施設","ごみ燃料化\n施設","その他の資源化等を行う施設","その他の\n施設",{"$nulls":4},"合計","粗大ごみ\n処理施設","ごみ堆肥化施設","ごみ飼料化施設","メタン化施設","ごみ燃料化\n施設","その他の資源化等を行う施設","その他の\n施設",{"$nulls":3},"合計","粗大ごみ\n処理施設","ごみ堆肥化施設","ごみ飼料化施設","メタン化施設","ごみ燃料化\n施設","その他の資源化等を行う施設","その他の\n施設"]
[]
[{"$nulls":3},"（ｔ）","（ｔ）","（ｔ）","（ｔ）","（ｔ）","（ｔ）","（ｔ）","（ｔ）","（ｔ）","（ｔ）","（ｔ）","（ｔ）","（ｔ）","（ｔ）","（ｔ）","（ｔ）","（ｔ）","（ｔ）","（ｔ）","（ｔ）","（ｔ）","（ｔ）","（ｔ）","（ｔ）","（ｔ）","（ｔ）","（ｔ）","（ｔ）","（ｔ）","（ｔ）","（ｔ）","（ｔ）","（ｔ）","（ｔ）","（ｔ）","（ｔ）","（ｔ）","（ｔ）","（ｔ）","（ｔ）","（ｔ）","（ｔ）"]
{"$rows_left_out":46}
{"sheet":"資源化量内訳","index":4,"n_rows":51,"n_cols":88,"rows_kept":51,"merged":[[1,0,5,0],[1,1,5,1],[1,2,5,2],[1,87,5,87],[2,3,4,3],[2,4,4,4],[2,5,4,5],[2,6,4,6],[2,7,4,7],[2,8,4,8],[2,9,4,9],[2,10,4,10],[2,11,4,11],[2,12,4,12],[2,13,4,13],[2,14,4,14],[2,15,4,15],[2,16,4,16],[2,17,4,17],[2,18,4,18],[2,19,4,19],[2,20,4,20],[2,21,4,21],[2,22,4,22],[2,23,4,23],[2,24,4,24],[2,25,4,25],[2,26,4,26],[2,27,4,27],[2,28,4,28],[2,29,4,29],[2,30,4,30],[2,31,4,31],[2,32,4,32],[2,33,4,33],[2,34,4,34],[2,35,4,35],[2,36,4,36],[2,37,4,37],[2,38,4,38],[2,39,4,39],[2,40,4,40],[2,41,4,41],[2,42,4,42],[2,43,4,43],[2,44,4,44],[2,45,4,45],[2,46,4,46],[2,47,4,47],[2,48,4,48],[2,49,4,49],[2,50,4,50],[2,51,4,51],[2,52,4,52],[2,53,4,53],[2,54,4,54],[2,55,4,55],[2,56,4,56],[2,57,4,57],[2,58,4,58],[2,59,4,59],[2,60,4,60],[2,61,4,61],[2,62,4,62],[2,63,4,63],[2,64,4,64],[2,65,4,65],[2,66,4,66],[2,67,4,67],[2,68,4,68],[2,69,4,69],[2,70,4,70],[2,71,4,71],[2,72,4,72],[2,73,4,73],[2,74,4,74],[2,75,4,75],[2,76,4,76],[2,77,4,77],[2,78,4,78],[2,79,4,79],[2,80,4,80],[2,81,4,81],[2,82,4,82],[2,83,4,83],[2,84,4,84],[2,85,4,85],[2,86,4,86]]}
["ごみ資源化の状況（平成28年度実績）"]
["都道府県名","地方公共団体コード","市区町村名","資源化量 (直接資源化量+中間処理後再生利用量+集団回収量)",{"$nulls":20},"直接資源化量 (紙類+金属類+ガラス類+ペットボトル+容器包装プラスチック+プラスチック類+布類+廃食用油+その他)",{"$nulls":20},"中間処理後再生利用量 (紙類+金属類+ガラス類+ペットボトル+容器包装プラスチック+プラスチック類+布類+肥料+飼料+溶融スラグ+固形燃料+燃料+焼却灰・飛灰+セメント直接投入+廃食用油+その他)",{"$nulls":20},"集団回収量 (紙類+金属類+ガラス類+ペットボトル+容器包装プラスチック+プラスチック類+布類+廃食用油+その他)",{"$nulls":20},"最終処分場の有無"]
[{"$nulls":3},"合計","紙類(02、03を除く)","紙パック","紙製容器包装","金属類","ガラス類","ペットボトル","白色トレイ","容器包装プラスチック(07を除く)","プラスチック類(07,08を除く)","布類","肥料","飼料","溶融スラグ","固形燃料\n（RDF,RPF）","燃料\n（14を除く）","焼却灰・飛灰のセメント原料化","セメント等への直接投入","飛灰の山元還元","廃食用油（BDF)","その他","合計","紙類(02、03を除く)","紙パック","紙製容器包装","金属類","ガラス類","ペットボトル","白色トレイ","容器包装プラスチック(07を除く)","プラスチック類(07,08を除く)","布類","肥料","飼料","溶融スラグ","固形燃料\n（RDF,RPF）","燃料\n（14を除く）","焼却灰・飛灰のセメント原料化","セメント等への直接投入","飛灰の山元還元","廃食用油（BDF)","その他","合計","紙類(02、03を除く)","紙パック","紙製容器包装","金属類","ガラス類","ペットボトル","白色トレイ","容器包装プラスチック(07を除く)","プラスチック類(07,08を除く)","布類","肥料","飼料","溶融スラグ","固形燃料\n（RDF,RPF）","燃料\n（14を除く）","焼却灰・飛灰のセメント原料化","セメント等への直接投入","飛灰の山元還元","廃食用油（BDF)","その他","合計","紙類(02、03を除く)","紙パック","紙製容器包装","金属類","ガラス類","ペットボトル","白色トレイ","容器包装プラスチック(07を除く)","プラスチック類(07,08を除く)","布類","肥料","飼料","溶融スラグ","固形燃料\n（RDF,RPF）","燃料\n（14を除く）","焼却灰・飛灰のセメント原料化","セメント等への直接投入","飛灰の山元還元","廃食用油（BDF)","その他"]
[]
[]
[{"$nulls":3},"（ｔ）","（ｔ）","（ｔ）","（ｔ）","（ｔ）","（ｔ）","（ｔ）","（ｔ）","（ｔ）","（ｔ）","（ｔ）","（ｔ）","（ｔ）","（ｔ）","（ｔ）","（ｔ）","（ｔ）","（ｔ）","（ｔ）","（ｔ）","（ｔ）","（ｔ）","（ｔ）","（ｔ）","（ｔ）","（ｔ）","（ｔ）","（ｔ）","（ｔ）","（ｔ）","（ｔ）","（ｔ）","（ｔ）","（ｔ）","（ｔ）","（ｔ）","（ｔ）","（ｔ）","（ｔ）","（ｔ）","（ｔ）","（ｔ）","（ｔ）","（ｔ）","（ｔ）","（ｔ）","（ｔ）","（ｔ）","（ｔ）","（ｔ）","（ｔ）","（ｔ）","（ｔ）","（ｔ）","（ｔ）","（ｔ）","（ｔ）","（ｔ）","（ｔ）","（ｔ）","（ｔ）","（ｔ）","（ｔ）","（ｔ）","（ｔ）","（ｔ）","（ｔ）","（ｔ）","（ｔ）","（ｔ）","（ｔ）","（ｔ）","（ｔ）","（ｔ）","（ｔ）","（ｔ）","（ｔ）","（ｔ）","（ｔ）","（ｔ）","（ｔ）","（ｔ）","（ｔ）","（ｔ）"]
{"$rows_left_out":46}
{"sheet":"施設資源化量内訳","index":5,"n_rows":51,"n_cols":171,"rows_kept":51,"merged":[[1,0,5,0],[1,1,5,1],[1,2,5,2],[2,3,4,3],[2,4,4,4],[2,5,4,5],[2,6,4,6],[2,7,4,7],[2,8,4,8],[2,9,4,9],[2,10,4,10],[2,11,4,11],[2,12,4,12],[2,13,4,13],[2,14,4,14],[2,15,4,15],[2,16,4,16],[2,17,4,17],[2,18,4,18],[2,19,4,19],[2,20,4,20],[2,21,4,21],[2,22,4,22],[2,23,4,23],[3,24,4,24],[3,25,4,25],[3,26,4,26],[3,27,4,27],[3,28,4,28],[3,29,4,29],[3,30,4,30],[3,31,4,31],[3,32,4,32],[3,33,4,33],[3,34,4,34],[3,35,4,35],[3,36,4,36],[3,37,4,37],[3,38,4,38],[3,39,4,39],[3,40,4,40],[3,41,4,41],[3,42,4,42],[3,43,4,43],[3,44,4,44],[3,45,4,45],[3,46,4,46],[3,47,4,47],[3,48,4,48],[3,49,4,49],[3,50,4,50],[3,51,4,51],[3,52,4,52],[3,53,4,53],[3,54,4,54],[3,55,4,55],[3,56,4,56],[3,57,4,57],[3,58,4,58],[3,59,4,59],[3,60,4,60],[3,61,4,61],[3,62,4,62],[3,63,4,63],[3,64,4,64],[3,65,4,65],[3,66,4,66],[3,67,4,67],[3,68,4,68],[3,69,4,69],[3,70,4,70],[3,71,4,71],[3,72,4,72],[3,73,4,73],[3,74,4,74],[3,75,4,75],[3,76,4,76],[3,77,4,77],[3,78,4,78],[3,79,4,79],[3,80,4,80],[3,81,4,81],[3,82,4,82],[3,83,4,83],[3,84,4,84],[3,85,4,85],[3,86,4,86],[3,87,4,87],[3,88,4,88],[3,89,4,89],[3,90,4,90],[3,91,4,91],[3,92,4,92],[3,93,4,93],[3,94,4,94],[3,95,4,95],[3,96,4,96],[3,97,4,97],[3,98,4,98],[3,99,4,99],[3,100,4,100],[3,101,4,101],[3,102,4,102],[3,103,4,103],[3,104,4,104],[3,105,4,105],[3,106,4,106],[3,107,4,107],[3,108,4,108],[3,109,4,109],[3,110,4,110],[3,111,4,111],[3,112,4,112],[3,113,4,113],[3,114,4,114],[3,115,4,115],[3,116,4,116],[3,117,4,117],[3,118,4,118],[3,119,4,119],[3,120,4,120],[3,121,4,121],[3,122,4,122],[3,123,4,123],[3,124,4,124],[3,125,4,125],[3,126,4,126],[3,127,4,127],[3,128,4,128],[3,129,4,129],[3,130,4,130],[3,131,4,131],[3,132,4,132],[3,133,4,133],[3,134,4,134],[3,135,4,135],[3,136,4,136],[3,137,4,137],[3,138,4,138],[3,139,4,139],[3,140,4,140],[3,141,4,141],[3,142,4,142],[3,143,4,143],[3,144,4,144],[3,145,4,145],[3,146,4,146],[3,147,4,147],[3,148,4,148],[3,149,4,149],[3,150,4,150],[3,151,4,151],[3,152,4,152],[3,153,4,153],[3,154,4,154],[3,155,4,155],[3,156,4,156],[3,157,4,157],[3,158,4,158],[3,159,4,159],[3,160,4,160],[3,161,4,161],[3,162,4,162],[3,163,4,163],[3,164,4,164],[3,165,4,165],[3,166,4,166],[3,167,4,167],[3,168,4,168],[3,169,4,169],[3,170,4,170]]}
["中間処理後の再生利用量の状況（平成28年度実績）"]
["都道府県名","地方公共団体コード","市区町村名","中間処理後再生利用量 (紙類+金属類+ガラス類+ペットボトル+容器包装プラスチック+プラスチック類+布類+肥料+飼料+溶融スラグ+固形燃料+燃料+焼却灰・飛灰+セメント直接投入+廃食用油+その他)"]
[{"$nulls":3},"合計","紙類(02、03を除く)","紙パック","紙製容器包装","金属類","ガラス類","ペットボトル","白色トレイ","容器包装プラスチック（07を除く）","プラスチック類（07,08を除く）","布類","肥料","飼料","溶融スラグ","固形燃料\n（RDF,RPF）","燃料\n（14を除く）","焼却灰・飛灰のセメント原料化","セメント等への直接投入","飛灰の山元還元","廃食用油（BDF)","その他","焼却施設処理に伴う資源化量(紙類+金属類+ガラス類+ペットボトル+容器包装プラスチック+プラスチック類+布類+溶融スラグ+焼却灰・飛灰+その他)",{"$nulls":20},"粗大ごみ処理施設処理に伴う資源化量(紙類+金属類+ガラス類+ペットボトル+容器包装プラスチック+プラスチック類+布類+その他)",{"$nulls":20},"ごみ堆肥化施設処理に伴う資源化量(紙類+金属類+ガラス類+ペットボトル+容器包装プラスチック+プラスチック類+布類+肥料+飼料+その他)",{"$nulls":20},"ごみ飼料化施設処理に伴う資源化量 (紙類+金属類+ガラス類+ペットボトル+容器包装プラスチック+プラスチック類+布類+肥料+飼料+その他)",{"$nulls":20},"メタン化施設処理に伴う資源化量 (紙類+金属類+ガラス類+プラスチック+容器包装プラスチック+プラスチック類+布類+肥料+飼料+燃料+その他)",{"$nulls":20},"ごみ燃料化施設処理に伴う資源化量 (紙類+金属類+ガラス類+ペットボトル+容器包装プラスチック+プラスチック類+布類+固形燃料+燃料+廃食用油+その他)",{"$nulls":20},"その他の資源化等を行う施設処理に伴う資源化量  (紙類+金属類+ガラス類+ペットボトル+容器包装プラスチック+プラスチック類+布類+肥料+飼料+焼却灰・飛灰+セメント直接投入+廃食用油+その他)"]
[{"$nulls":24},"合計","紙類(02、03を除く)","紙パック","紙製容器包装","金属類","ガラス類","ペットボトル","白色トレイ","容器包装プラスチック（07を除く）","プラスチック類(07,08を除く)","布類","肥料","飼料","溶融スラグ","固形燃料\n（RDF,RPF）","燃料\n（14を除く）","焼却灰・飛灰のセメント原料化","セメント等への直接投入","飛灰の山元還元","廃食用油（BDF)","その他","合計","紙類(02、03を除く)","紙パック","紙製容器包装","金属類","ガラス類","ペットボトル","白色トレイ","容器包装プラスチック（07を除く）","プラスチック類(07,08を除く)","布類","肥料","飼料","溶融スラグ","固形燃料\n（RDF,RPF）","燃料\n（14を除く）","焼却灰・飛灰のセメント原料化","セメント等への直接投入","飛灰の山元還元","廃食用油（BDF)","その他","合計","紙類(02、03を除く)","紙パック","紙製容器包装","金属類","ガラス類","ペットボトル","白色トレイ","容器包装プラスチック（07を除く）","プラスチック類(07,08を除く)","布類","肥料","飼料","溶融スラグ","固形燃料\n（RDF,RPF）","燃料\n（14を除く）","焼却灰・飛灰のセメント原料化","セメント等への直接投入","飛灰の山元還元","廃食用油（BDF)","その他","合計","紙類(02、03を除く)","紙パック","紙製容器包装","金属類","ガラス類","ペットボトル","白色トレイ","容器包装プラスチック（07を除く）","プラスチック類(07,08を除く)","布類","肥料","飼料","溶融スラグ","固形燃料\n（RDF,RPF）","燃料\n（14を除く）","焼却灰・飛灰のセメント原料化","セメント等への直接投入","飛灰の山元還元","廃食用油（BDF)","その他","合計","紙類(02、03を除く)","紙パック","紙製容器包装","金属類","ガラス類","ペットボトル","白色トレイ","容器包装プラスチック（07を除く）","プラスチック類(07,08を除く)","布類","肥料","飼料","溶融スラグ","固形燃料\n（RDF,RPF）","燃料\n（14を除く）","焼却灰・飛灰のセメント原料化","セメント等への直接投入","飛灰の山元還元","廃食用油（BDF)","その他","合計","紙類(02、03を除く)","紙パック","紙製容器包装","金属類","ガラス類","ペットボトル","白色トレイ","容器包装プラスチック（07を除く）","プラスチック類(07,08を除く)","布類","肥料","飼料","溶融スラグ","固形燃料\n（RDF,RPF）","燃料\n（14を除く）","焼却灰・飛灰のセメント原料化","セメント等への直接投入","飛灰の山元還元","廃食用油（BDF)","その他","合計","紙類(02、03を除く)","紙パック","紙製容器包装","金属類","ガラス類","ペットボトル","白色トレイ","容器包装プラスチック（07を除く）","プラスチック類(07,08を除く)","布類","肥料","飼料","溶融スラグ","固形燃料\n（RDF,RPF）","燃料\n（14を除く）","焼却灰・飛灰のセメント原料化","セメント等への直接投入","飛灰の山元還元","廃食用油（BDF)","その他"]
[]
[{"$nulls":3},"（ｔ）","（ｔ）","（ｔ）","（ｔ）","（ｔ）","（ｔ）","（ｔ）","（ｔ）",null,"（ｔ）","（ｔ）","（ｔ）","（ｔ）","（ｔ）","（ｔ）","（ｔ）","（ｔ）","（ｔ）","（ｔ）","（ｔ）","（ｔ）","（ｔ）","（ｔ）","（ｔ）","（ｔ）","（ｔ）","（ｔ）","（ｔ）","（ｔ）","（ｔ）","（ｔ）","（ｔ）","（ｔ）","（ｔ）","（ｔ）","（ｔ）","（ｔ）","（ｔ）","（ｔ）","（ｔ）","（ｔ）","（ｔ）","（ｔ）","（ｔ）","（ｔ）","（ｔ）","（ｔ）","（ｔ）","（ｔ）","（ｔ）","（ｔ）","（ｔ）","（ｔ）","（ｔ）","（ｔ）","（ｔ）","（ｔ）","（ｔ）","（ｔ）","（ｔ）","（ｔ）","（ｔ）","（ｔ）","（ｔ）","（ｔ）","（ｔ）","（ｔ）","（ｔ）","（ｔ）","（ｔ）","（ｔ）","（ｔ）","（ｔ）","（ｔ）","（ｔ）","（ｔ）","（ｔ）","（ｔ）","（ｔ）","（ｔ）","（ｔ）","（ｔ）","（ｔ）","（ｔ）","（ｔ）","（ｔ）","（ｔ）","（ｔ）","（ｔ）","（ｔ）","（ｔ）","（ｔ）","（ｔ）","（ｔ）","（ｔ）","（ｔ）","（ｔ）","（ｔ）","（ｔ）","（ｔ）","（ｔ）","（ｔ）","（ｔ）","（ｔ）","（ｔ）","（ｔ）","（ｔ）","（ｔ）","（ｔ）","（ｔ）","（ｔ）","（ｔ）","（ｔ）","（ｔ）","（ｔ）","（ｔ）","（ｔ）","（ｔ）","（ｔ）","（ｔ）","（ｔ）","（ｔ）","（ｔ）","（ｔ）","（ｔ）","（ｔ）","（ｔ）","（ｔ）","（ｔ）","（ｔ）","（ｔ）","（ｔ）","（ｔ）","（ｔ）","（ｔ）","（ｔ）","（ｔ）","（ｔ）","（ｔ）","（ｔ）","（ｔ）","（ｔ）","（ｔ）","（ｔ）","（ｔ）","（ｔ）","（ｔ）","（ｔ）","（ｔ）","（ｔ）","（ｔ）","（ｔ）","（ｔ）","（ｔ）","（ｔ）","（ｔ）","（ｔ）","（ｔ）","（ｔ）","（ｔ）","（ｔ）","（ｔ）","（ｔ）","（ｔ）","（ｔ）","（ｔ）","（ｔ）","（ｔ）"]
{"$rows_left_out":46}
{"sheet":"災害廃棄物搬入量","index":6,"n_rows":51,"n_cols":103,"rows_kept":51,"merged":[[1,0,5,0],[1,1,5,1],[1,2,5,2],[1,79,1,86],[2,3,3,3],[2,4,4,4],[2,5,2,12],[2,13,4,13],[2,14,4,14],[2,15,4,15],[2,16,4,16],[2,17,4,17],[2,18,4,18],[2,19,4,19],[2,20,4,20],[2,21,4,21],[2,22,4,22],[2,23,4,23],[2,24,4,24],[2,25,4,25],[2,26,4,26],[2,27,4,27],[2,28,4,28],[2,29,4,29],[2,30,4,30],[2,31,4,31],[2,32,4,32],[2,33,4,33],[2,34,4,34],[2,35,4,35],[2,36,4,36],[2,37,4,37],[2,38,4,38],[2,39,4,39],[2,40,4,40],[2,41,4,41],[2,42,4,42],[2,43,4,43],[2,44,4,44],[2,45,4,45],[2,46,4,46],[2,47,4,47],[2,48,4,48],[2,49,4,49],[2,50,4,50],[2,51,4,51],[2,52,4,52],[2,53,4,53],[2,54,4,54],[2,55,4,55],[2,56,4,56],[2,57,4,57],[2,58,4,58],[2,59,4,59],[2,60,4,60],[2,61,4,61],[2,62,4,62],[2,63,4,63],[2,64,4,64],[2,65,4,65],[2,66,4,66],[2,67,4,67],[2,68,4,68],[2,69,4,69],[2,70,4,70],[2,71,4,71],[2,72,4,72],[2,73,4,73],[2,74,4,74],[2,75,4,75],[2,76,4,76],[2,77,4,77],[2,78,4,78],[2,79,4,79],[2,80,4,80],[2,81,4,81],[2,82,4,82],[2,83,4,83],[2,84,4,84],[2,85,4,85],[2,86,4,86],[2,87,4,87],[2,88,4,88],[2,89,4,89],[2,90,4,90],[2,91,4,91],[2,92,4,92],[2,93,4,93],[2,94,4,94],[2,95,4,95],[2,96,4,96],[2,97,4,97],[2,98,4,98],[2,99,4,99],[2,100,4,100],[2,101,4,101],[2,102,4,102],[3,5,4,5],[3,6,4,6],[3,7,4,7],[3,8,4,8],[3,9,4,9],[3,10,4,10],[3,11,4,11],[3,12,4,12]]}
["災害廃棄物の処理処分状況（平成28年度実績）"]
["都道府県名","地方公共団体コード","市区町村名","災害廃棄物の搬入量(焼却施設+焼却以外の中間処理施設+直接最終処分量+直接資源化量)",{"$nulls":11},"収集区分別の搬入量(がれき類+混合ごみ+可燃ごみ+不燃ごみ+資源ごみ+その他+粗大ごみ)",{"$nulls":7},"焼却施設の搬入量(がれき類+混合ごみ+可燃ごみ+不燃ごみ+資源ごみ+その他+粗大ごみ)",{"$nulls":7},"粗大ごみ処理施設の搬入量(がれき類+混合ごみ+可燃ごみ+不燃ごみ+資源ごみ+その他+粗大ごみ)",{"$nulls":7},"ごみ堆肥化施設の搬入量(がれき類+混合ごみ+可燃ごみ+不燃ごみ+資源ごみ+その他+粗大ごみ)",{"$nulls":7},"ごみ飼料化施設の搬入量(がれき類+混合ごみ+可燃ごみ+不燃ごみ+資源ごみ+その他+粗大ごみ)",{"$nulls":7},"メタン化施設の搬入量(がれき類+混合ごみ+可燃ごみ+不燃ごみ+資源ごみ+その他+粗大ごみ)",{"$nulls":7},"ごみ燃料化施設の搬入量(がれき類+混合ごみ+可燃ごみ+不燃ごみ+資源ごみ+その他+粗大ごみ)",{"$nulls":7},"その他の資源化等を行う施設の搬入量(がれき類+混合ごみ+可燃ごみ+不燃ごみ+資源ごみ+その他+粗大ごみ)",{"$nulls":7},"その他の施設の搬入量(がれき類+混合ごみ+可燃ごみ+不燃ごみ+資源ごみ+その他+粗大ごみ)",{"$nulls":7},"直接最終処分量(がれき類+混合ごみ+可燃ごみ+不燃ごみ+資源ごみ+その他+粗大ごみ)",{"$nulls":7},"直接資源化量(がれき類+混合ごみ+可燃ごみ+不燃ごみ+資源ごみ+その他+粗大ごみ)"]
[{"$nulls":3},"合計","焼却施設","焼却以外の中間処理施設搬入量(粗大ごみ処理施設+ごみ堆肥化施設+ごみ飼料化施設+メタン化施設+ごみ燃料化施設+その他の資源化等を行う施設+その他の施設)",{"$nulls":7},"直接最終処分量","直接資源化量","合計","がれき類","混合ごみ","可燃ごみ","不燃ごみ","資源ごみ","その他","粗大ごみ","合計","がれき類","混合ごみ","可燃ごみ","不燃ごみ","資源ごみ","その他","粗大ごみ","合計","がれき類","混合ごみ","可燃ごみ","不燃ごみ","資源ごみ","その他","粗大ごみ","合計","がれき類","混合ごみ","可燃ごみ","不燃ごみ","資源ごみ","その他","粗大ごみ","合計","がれき類","混合ごみ","可燃ごみ","不燃ごみ","資源ごみ","その他","粗大ごみ","合計","がれき類","混合ごみ","可燃ごみ","不燃ごみ","資源ごみ","その他","粗大ごみ","合計","がれき類","混合ごみ","可燃ごみ","不燃ごみ","資源ごみ","その他","粗大ごみ","合計","がれき類","混合ごみ","可燃ごみ","不燃ごみ","資源ごみ","その他","粗大ごみ","合計","がれき類","混合ごみ","可燃ごみ","不燃ごみ","資源ごみ","その他","粗大ごみ","合計","がれき類","混合ごみ","可燃ごみ","不燃ごみ","資源ごみ","その他","粗大ごみ","合計","がれき類","混合ごみ","可燃ごみ","不燃ごみ","資源ごみ","その他","粗大ごみ"]
[{"$nulls":5},"合計","粗大ごみ処理施設","ごみ堆肥化施設","ごみ飼料化施設","メタン化施設","ごみ燃料化施設","その他の資源化等を行う施設","その他の施設"]
[]
[{"$nulls":3},"（ｔ）","（ｔ）","（ｔ）","（ｔ）","（ｔ）","（ｔ）","（ｔ）","（ｔ）","（ｔ）","（ｔ）","（ｔ）","（ｔ）","（ｔ）","（ｔ）","（ｔ）","（ｔ）","（ｔ）","（ｔ）","（ｔ）","（ｔ）","（ｔ）","（ｔ）","（ｔ）","（ｔ）","（ｔ）","（ｔ）","（ｔ）","（ｔ）","（ｔ）","（ｔ）","（ｔ）","（ｔ）","（ｔ）","（ｔ）","（ｔ）","（ｔ）","（ｔ）","（ｔ）","（ｔ）","（ｔ）","（ｔ）","（ｔ）","（ｔ）","（ｔ）","（ｔ）","（ｔ）","（ｔ）","（ｔ）","（ｔ）","（ｔ）","（ｔ）","（ｔ）","（ｔ）","（ｔ）","（ｔ）","（ｔ）","（ｔ）","（ｔ）","（ｔ）","（ｔ）","（ｔ）","（ｔ）","（ｔ）","（ｔ）","（ｔ）","（ｔ）","（ｔ）","（ｔ）","（ｔ）","（ｔ）","（ｔ）","（ｔ）","（ｔ）","（ｔ）","（ｔ）","（ｔ）","（ｔ）","（ｔ）","（ｔ）","（ｔ）","（ｔ）","（ｔ）","（ｔ）","（ｔ）","（ｔ）","（ｔ）","（ｔ）","（ｔ）","（ｔ）","（ｔ）","（ｔ）","（ｔ）","（ｔ）","（ｔ）","（ｔ）","（ｔ）","（ｔ）","（ｔ）","（ｔ）","（ｔ）"]
{"$rows_left_out":46}
{"sheet":"ごみ集計結果","index":7,"n_rows":250,"n_cols":31,"rows_kept":250,"merged":[[4,7,5,10],[4,11,5,11],[4,12,4,14],[4,15,5,15],[6,7,22,7],[6,8,13,8],[7,1,7,3],[7,9,13,9],[8,1,8,3],[10,1,10,3],[11,1,25,1],[11,2,17,2],[15,8,21,8],[18,2,24,2],[26,7,26,10],[31,1,31,3]]}
["合計 処理量（平成28年度実績）ごみ処理フローシート"]
[null,null,"入力→",null,":市区町村コード(都道府県計は、01000～47000の何れか）",{"$nulls":8},{"$f":"LEFT(D2,2)","v":""},{"$f":"IF(N2=\"\",\"-\",IF(N2>0,VLOOKUP(N2,$AD$6:$AE$53,2,FALSE),\"-\"))","v":"-"},{"$nulls":6},{"$f":"+IF(VALUE(D2)=0,0,1)","v":0},{"$f":"IF(V2=0,\"\",VLOOKUP(D2,INDIRECT(W6&\"!B7:C250\"),2,FALSE))","v":""},null,{"$f":"IF(V2=0,1,IF(ISERROR(W2),1,0))","v":1},null,{"$f":"COUNTA(INDIRECT(\"'[\"&$W$6&\"]ごみ処理概要!B7:C250\"))+6","v":7},{"$f":"IF(V2=0,0,VLOOKUP(D2,AA5:AB250,2,FALSE))","v":0}]
[]
[null,"合計 処理量（平成28年度実績）"]
[{"$nulls":7},"ごみ処理処分量",{"$nulls":3},"処理量","処分量",null,null,"中間処理後\n保管量",{"$nulls":10},{"$f":"INDIRECT($W$6&\"!\"&\"B\"&ROW(B5))","v":0},5]
[null,null,"計画収集人口",null,{"$f":"Y6","v":{"v":0,"d":"0 "}},{"$nulls":7},"残渣焼却量","残渣処分量","資源化量",{"$nulls":6},"計画収集人口","ごみ処理概要","E",{"$f":"IF(Y$2=0,INDIRECT(W6&\"!\"&X6&$AB$2),0)","v":0},null,0,6,null,"01","北海道"]
{"$rows_left_out":245}
{"sheet":"ごみフローシート","index":8,"n_rows":47,"n_cols":16,"rows_kept":47,"merged":[[0,0,1,15],[3,0,3,2],[7,1,7,2],[36,14,37,15]]}
["合計 処理量（平成28年度実績）　ごみ処理フローシート"]
[]
[]
[{"$nulls":4},"直接最終処分量",{"$nulls":9},"最終処分場"]
[{"$nulls":4},"(21,09,03)",{"$f":"INDIRECT(B47&\"!L26\")","v":{"v":0,"d":"0 "}},{"$nulls":8},"(21,09,01)",{"$f":"INDIRECT(B47&\"!N27\")","v":{"v":0,"d":"0 "}}]
[]
{"$rows_left_out":41}