{"text_format":"1","workbook":"xlsx","n_sheets":16,"sheets":["集計1","目次","ｼｰﾄ0","ｼｰﾄ1","ｼｰﾄ2","ｼｰﾄ3","ｼｰﾄ4","ｼｰﾄ5","ｼｰﾄ6","目次 (2)","ｼｰﾄ7","ｼｰﾄ8","ｼｰﾄ10","ｼｰﾄ12","ｼｰﾄ14","Sheet1"],"not_rendered":{"charts":0,"images":0,"macros":1,"external_links":0,"defined_names":60,"comments":0,"pivot_tables":0},"unopened":[],"bounds":{"document_bytes":16777216,"sheet_cells":100000,"rows_first":2000,"rows_last":500,"rows_between":2000,"halvings":0,"cell_chars":16384,"cell_head_chars":4096},"cells_cut":0,"cells_raw":0,"read":"whole","date_system":"1900"}

{"sheet":"集計1","index":0,"n_rows":52,"n_cols":41,"rows_kept":52,"cut":false,"hidden":true,"merged":[[3,36,8,36],[2,29,2,35],[5,33,8,33],[4,21,8,21],[5,27,8,27],[4,14,8,14],[4,19,8,19],[2,25,4,25],[4,16,8,16],[2,26,4,28],[5,28,8,28],[5,25,8,25],[2,22,3,22],[2,23,3,23],[5,22,8,22],[5,23,8,23],[1,0,9,0],[1,3,8,3],[2,6,3,9],[2,10,3,13],[4,7,8,7],[1,1,8,1],[1,2,8,2],[4,9,8,9],[4,11,8,11],[4,12,8,12],[1,40,8,40],[1,39,8,39],[3,29,4,30],[5,31,8,31],[5,26,8,26],[5,29,8,29],[2,38,8,38],[3,37,8,37],[5,35,8,35],[5,32,8,32],[3,31,4,35],[5,34,8,34],[5,30,8,30],[2,36,2,37],[1,29,1,38],[1,25,1,28],[0,16,0,20],[1,4,1,21],[0,14,0,15],[4,18,8,18],[4,17,8,17],[4,6,8,6],[4,10,8,10],[2,4,8,4],[4,5,8,5],[4,8,8,8],[4,20,8,20],[4,13,8,13],[2,14,3,17],[7,15,8,15],[4,15,6,15],[2,18,3,21]]}
[null,"主要地域の地盤沈下等の状況（地域計）",null,null,null,null,null,null,null," "]
["番号","都道府県","地　域","令和4年度\n水準測量が実施された地域              ","地　　盤　　沈　　下　　の　　状　　況",null,null,null,null,null,null,null,null,null,null,null,null,null,null,null,null,null,"現行法による\n地下水採取規制地域",null,"地盤沈下防止等対策要綱","観測状況",null,null,null,"被害の状況\n●:対策済　○:一部対策が施されているものを含め、現在なお被害が認められるもの　△:極めて局部的に被害が認められるもの",null,null,null,null,null,null,null,null,null,"地　域","都道府県"]
[null,null,null,null,"現在までに\n沈下が認め\nられた地域\nの面積(㎢)",null,"地域内での水準点の\n累計沈下量",null,null,null,"地域内での水準点の直近５年間の\n累計沈下量",null,null,null,"直近の測量による水準点の\n１年間沈下量",null,null,null,"R4年度の測量で沈下が生じている\n地域の沈下量別面積（㎢）",null,null,null,"工業用水法\n指定地域の面積","ビル用水法\n指定地域の面積","  規制地域 ：■","水準\n測量","観測井戸数(本)",null,null,"直接被害",null,null,null,null,null,null,"間接被害",null," 地下水の塩水化"]
[null,null,null,null,null,null,null,null,null,null,null,null,null,null,null,null,null,null,null,null,null,null,null,null,"  観測地域 ：◆",null,null,null,null,"一般施設",null,"公共施設",null,null,null,null," 洪水・高潮の危険性大"," 排水不良"]
[null,null,null,null,null,"ゼロメートル地帯面積(㎢)","最大値\n（ｃｍ）","対象　　　期間","水準点番号","所在地","最大値\n（ｃｍ）","対象　　　期間","水準点番号","所在地","最大値\n（ｃｍ）","測量の\n年度","水準点番号","所在地","1cm/年\n以上","2cm/年\n以上","3cm/年\n以上","4cm/年\n以上"]
[null,null,null,null,null,null,null,null,null,null,null,null,null,null,null,null,null,null,null,null,null,null,"うち(  )はゼロメートル地帯面積\n(㎢)","うち(  )はゼロメートル地帯面積\n(㎢)","地方の規制等","測量\n距離\n(km)","地下\n水位\nのみ","地盤\n収縮\nのみ","地下\n水位\n及び\n地盤\n収縮"," 建築物の破損または脆弱化","井戸等の抜け上がり"," 港湾・海岸施 設の沈下　　　　　　","堤防・護岸等の沈下","道路・橋梁等の沈下・破損","農業用水路の沈下・破損","埋設物の破損"]
[null,null,null,null,null,null,null,null,null,null,null,null,null,null,null,null,null,null,null,null,null,null,null,null,"　条例 　　　：□　"]
[null,null,null,null,null,null,null,null,null,null,null,null,null,null,null,"または\n期間※",null,null,null,null,null,null,null,null,"　要綱等　　：◇　"]
[]
[null,null,null,null,null,null,"\nシート１で入力された内容がコピーされます。",null,null,null,"\nシート１で入力された内容がコピーされます。",null,null,null,"\nシート１で入力された内容がコピーされます。",null,null,null,"\nシート3で入力された内容がコピーされます。"]
[null,{"$f":"IF(ｼｰﾄ0!C3=\"\",\"\",ｼｰﾄ0!C3)","v":"三重県"},{"$f":"IF(ｼｰﾄ0!C4=\"\",\"\",ｼｰﾄ0!C4)","v":"濃尾平野（北勢）"},{"$f":"IF(OR(ｼｰﾄ1!D25<>\"\",ｼｰﾄ1!E25<>\"\",ｼｰﾄ1!F25<>\"\"),\"○\",\"\")","v":"○"},{"$f":"IF(ｼｰﾄ3!C68<>\"\",ｼｰﾄ3!C68,\"\")","v":120},{"$f":"IF(ｼｰﾄ3!D68<>\"\",ｼｰﾄ3!D68,\"\")","v":55},{"$f":"IF(ｼｰﾄ1!D13<>\"\",ｼｰﾄ1!D13,\"\")","v":163.71},{"$f":"IF(ｼｰﾄ1!D11<>\"\",ｼｰﾄ1!D11,\"\")","v":"S36～R5"},{"$f":"IF(ｼｰﾄ1!D7<>\"\",ｼｰﾄ1!D7,\"\")","v":"C35-16"},{"$f":"IF(ｼｰﾄ1!D8<>\"\",ｼｰﾄ1!D8,\"\")","v":"三重県桑名市長島町白鶏715"},{"$f":"IF(ｼｰﾄ1!E14<>\"\",ｼｰﾄ1!E14,\"\")","v":6.52},{"$f":"IF(ｼｰﾄ1!E11<>\"\",ｼｰﾄ1!E11,\"\")","v":"R1～R5"},{"$f":"IF(ｼｰﾄ1!E7<>\"\",ｼｰﾄ1!E7,\"\")","v":"HR12-1"},{"$f":"IF(ｼｰﾄ1!E8<>\"\",ｼｰﾄ1!E8,\"\")","v":"三重県桑名市多度町中須"},{"$f":"IF(ｼｰﾄ1!F15<>\"\",ｼｰﾄ1!F15,\"\")","v":1.2},{"$f":"IF(ｼｰﾄ1!F11<>\"\",ｼｰﾄ1!F11,\"\")","v":"R5"},{"$f":"IF(ｼｰﾄ1!F7<>\"\",ｼｰﾄ1!F7,\"\")","v":"HR12-1"},{"$f":"IF(ｼｰﾄ1!F8<>\"\",ｼｰﾄ1!F8,\"\")","v":"三重県桑名市多度町中須"},{"$f":"IF(ｼｰﾄ3!E68<>\"\",ｼｰﾄ3!E68,\"\")","v":"- #"},{"$f":"IF(ｼｰﾄ3!F68<>\"\",ｼｰﾄ3!F68,\"\")","v":"-"},{"$f":"IF(ｼｰﾄ3!G68<>\"\",ｼｰﾄ3!G68,\"\")","v":"-"},{"$f":"IF(ｼｰﾄ3!H68<>\"\",ｼｰﾄ3!H68,\"\")","v":"-"},null,null,{"$f":"IF(ｼｰﾄ3!I68<>\"\",ｼｰﾄ3!I68,\"\")","v":"■ ◆ □"},{"$f":"IF(ｼｰﾄ5!D15<>\"\",ｼｰﾄ5!D15,\"\")","v":187},{"$f":"IF(ｼｰﾄ5!D25=\"\",\"\",ｼｰﾄ5!D25)","v":16},{"$f":"IF(ｼｰﾄ5!E25=\"\",\"\",ｼｰﾄ5!E25)","v":""},{"$f":"IF(ｼｰﾄ5!F25=\"\",\"\",ｼｰﾄ5!F25)","v":5},{"$f":"IF(ｼｰﾄ4!C8=\"\",\"\",ｼｰﾄ4!C8)","v":""},{"$f":"IF(ｼｰﾄ4!D8=\"\",\"\",ｼｰﾄ4!D8)","v":"○"},{"$f":"IF(ｼｰﾄ4!E8=\"\",\"\",ｼｰﾄ4!E8)","v":"○"},{"$f":"IF(ｼｰﾄ4!F8=\"\",\"\",ｼｰﾄ4!F8)","v":"○"},{"$f":"IF(ｼｰﾄ4!G8=\"\",\"\",ｼｰﾄ4!G8)","v":""},{"$f":"IF(ｼｰﾄ4!H8=\"\",\"\",ｼｰﾄ4!H8)","v":"○"},{"$f":"IF(ｼｰﾄ4!I8=\"\",\"\",ｼｰﾄ4!I8)","v":"○"},{"$f":"IF(ｼｰﾄ4!J8=\"\",\"\",ｼｰﾄ4!J8)","v":"○"},{"$f":"IF(ｼｰﾄ4!K8=\"\",\"\",ｼｰﾄ4!K8)","v":"○"},{"$f":"IF(ｼｰﾄ4!L8=\"\",\"\",ｼｰﾄ4!L8)","v":"○"},{"$f":"IF(ｼｰﾄ0!C4=\"\",\"\",ｼｰﾄ0!C4)","v":"濃尾平野（北勢）"},{"$f":"IF(ｼｰﾄ0!C3=\"\",\"\",ｼｰﾄ0!C3)","v":"三重県"}]
[]
[]
[]
[null,null,null,null,null,null,null,null,null,null,null,null,null,null,null,null,null,null,null,null,null,null,null,null,null,null,null,null,null,null,"\n"]
[]
[]
[]
[]
[]
[]
[]
[]
[]
[]
[]
[]
[]
[]
[]
[]
[]
[]
[]
[]
[]
[]
[]
[]
[]
[]
[]
[]
[]
[]
[]
[]
[]
[]
[]
[]
[null,null,null,null,null,null,null,null,null,null,null,null,null,null,null,null,null,null,null,null,null,null,null,null,null,null,null,null,"□ ◇"]

{"sheet":"目次","index":1,"n_rows":55,"n_cols":6,"rows_kept":55,"cut":false,"hidden":false,"merged":[[0,0,0,1],[0,3,0,5],[1,0,1,1]]}
["　＜詳細データ目次＞",null,null,"旧  ＜詳細データ目次＞　"]
["地盤沈下等の概況",null,null,"１．地盤沈下等の概況"]
["０．","地名など"]
["１．","主な水準点における過去10年の沈下量経年変化",null,null,"１－２．","代表的な観測井における過去10年の地下水位経年変化"]
["２．","代表的な観測井における過去10年の地下水位経年変化",null,null,"１－３．","地盤沈下地域の面積"]
["３．","主要地域の地盤沈下等の状況（市町村別内訳）",null,null,"１－４．","水位低下等による被害の状況"]
["４．","水位低下等による被害の状況",null,null,"２－１．","地盤沈下監視体制（水準測量）"]
["５．","地盤沈下監視体制（水準測量、干渉SAR解析を用いた測量、観測井戸数）",null,null,"５－２．","工業用水法第５条第２項の適用状況"]
["６．","地区別、用途別、井戸本数及び地下水採取量経年変化"]
[null,null,null,null,"５－５．","工業用水法第10条第３項に基づく届出書受理状況"]
["用水二法の施行状況",null,null,"３．関連制度の状況"]
["１．","工業用水法第３条第１項及び第７条第１項の許可状況",null,null,"３－１．","関連制度の種類"]
["２．","工業用水法第５条第２項の適用状況",null,null,"３－２．","関連制度の経緯及び改定等の内容"]
["３．","工業用水法第６条第３項に基づく届出書受理状況",null,null,"３－３．","関連制度の内容（法律）"]
["４．","工業用水法第９条に基づく届出書受理状況",null,null,"３－４．","関連制度の内容（条例）"]
["５．","工業用水法第10条第３項に基づく届出書受理状況",null,null,"３－５．","関連制度の内容（要綱）"]
["６．","工業用水法第11条に基づく届出書受理状況",null,null,"３－６．","関連制度の内容（その他）"]
["７．","工業用水法第24条の規定に基づく許可井戸の変更報告状況",null,"４．地下水・地盤沈下対策の状況"]
["８．","工業用水法第24条の規定に基づく井戸使用状況報告",null,null,"４－１．","地下水採取量の用途別削減量"]
["９．","ビル用水法第４条第１項の許可状況",null,null,"４－２．","合理化施策による地下水採取削減量"]
["１０．","ビル用水法第４条第３項の適用状況",null,null,"４－３．","代替水対策による地下水採取削減量"]
["１１．","ビル用水法第６条第３項に基づく届出書受理状況",null,null,"４－４．","地盤沈下対策事業及び調査事業費の推移"]
["１２．","ビル用水法第７条に基づく届出書受理状況",null,null,"４－５．","地盤沈下対策事業（代替水事業）の内容"]
["１３．","ビル用水法第８条第３項に基づく届出書受理状況",null,null,"４－６．","地盤沈下対策事業（防災事業等）の内容"]
["１４．","ビル用水法第９条に基づく届出書受理状況",null,null,"４－７．","調査等事業の内容"]
["１５．","ビル用水法第13条の規定に基づく許可井戸の変更報告状況",null,null,"４－８．","地下水・地盤環境保全施策の組織"]
["１６．","ビル用水法第13条の規定に基づく井戸使用状況報告",null,"５．用水二法の施行状況"]
[null,null,null,null,"５－６．","工業用水法第11条に基づく届出書受理状況"]
[null,null,null,null,"５－７．","工業用水法第24条の規定に基づく許可井戸の変更報告状況"]
[null,null,null,null,"５－８．","工業用水法第24条の規定に基づく井戸使用状況報告"]
[null,null,null,null,"５－９．","ビル用水法第４条第１項の許可状況"]
[null,null,null,null,"５－10．","ビル用水法第４条第３項の適用状況"]
[null,null,null,null,"５－11．","ビル用水法第６条第３項に基づく届出書受理状況"]
[null,null,null,null,"５－12．","ビル用水法第７条に基づく届出書受理状況"]
[null,null,null,null,"５－13．","ビル用水法第８条第３項に基づく届出書受理状況"]
[null,null,null,null,"５－14．","ビル用水法第９条に基づく届出書受理状況"]
[null,null,null,null,"５－15．","ビル用水法第13条の規定に基づく許可井戸の変更報告状況"]
[null,null,null,null,"５－16．","ビル用水法第13条の規定に基づく井戸使用状況報告"]
[null,null,null,"６．地下水の利用状況"]
[null,null,null,null,"６－１．","地区別、用途別、井戸本数及び地下水採取量経年変化"]
[null,null,null,null,"６－２．","地下水採取量等の調査の内容"]
[null,null,null,null,"６－３．","地下水の月別採取量"]
[null,null,null,null,"６－４．","特定用途の地下水採取量（天然ガスかん水）"]
[null,null,null,null,"６－５．","特定用途の地下水採取量（温泉水）"]
[null,null,null,null,"６－６．","特定用途の地下水採取量（農業用水）"]
[null,null,null,null,"６－７．","特定用途の地下水採取量（道路消雪用水）"]
[null,null,null,"７．その他"]
[null,null,null,null,"７－１．","健全な水循環の確保に向けての取組みに関する調査（地下水保全計画等を含む）"]
[null,null,null,null,"７－２．","地盤環境に係る情報システムの整備状況"]
[null,null,null,null,"７－３．","地盤環境に係る情報開示の状況"]
[null,null,null,null,"７－４．","アンケート"]
[]
[null,null,null,null,null,"：ピンク色の項目群が調査依頼の対象外としました。"]
[]
[null,null,null,"※ 地域により該当のデータがない場合があります。"]

{"sheet":"ｼｰﾄ0","index":2,"n_rows":22,"n_cols":49,"rows_kept":22,"cut":false,"hidden":false,"merged":[]}
[null,null,"0.都道府県名、地域名"]
[]
[null,"都道府県名","三重県"]
[null,"地域名","濃尾平野（北勢）"]
[]
[]
[]
[]
[]
[null,"北海道","青森県","岩手県","宮城県","秋田県","山形県","福島県","茨城県","栃木県","群馬県","埼玉県","千葉県","東京都","神奈川県","新潟県","富山県","石川県","福井県","山梨県","長野県","岐阜県","静岡県","愛知県","三重県","滋賀県","京都府","大阪府","兵庫県","奈良県","和歌山県","鳥取県","島根県","岡山県","広島県","山口県","徳島県","香川県","愛媛県","高知県","福岡県","佐賀県","長崎県","熊本県","大分県","宮崎県","鹿児島県","沖縄県"]
[null,"石狩平野","青森平野","岩手","石巻地域","象潟・金浦","山形盆地","福島盆地","関東平野","関東平野","関東平野","関東平野","関東平野南部","関東平野南部","関東平野南部","新潟平野","富山・砺波平野","七尾","福井平野","甲府盆地","諏訪盆地","濃尾平野","静岡\n（静清）","濃尾平野","濃尾平野（北勢）","滋賀","京都盆地","大阪平野","豊岡盆地","奈良","和歌山","鳥取平野","島根","岡山平野","広島平野","山口","徳島平野","讃岐平野（高松市周辺）","愛媛","高知平野","筑後・佐賀平野","筑後・佐賀平野","島原半島基部","熊本平野","大分平野","宮崎平野","鹿児島","沖縄"]
[null,"釧路平野","津軽平野",null,"気仙沼",null,"米沢盆地","原町",null,null,null,null,"九十九里平野",null,"県央湘南","長岡",null,"金沢平野",null,null,null,null,"岳南","豊橋平野(東三河)",null,null,null,null,"播磨平野（姫路平野）",null,null,null,null,null,null,null,null,"讃岐平野（丸亀・坂出市周辺）"]
[null,"十勝平野","八戸",null,"古川(仙北平野）",null,null,"いわき",null,null,null,null,null,null,"足柄平野","柏崎",null,null,null,null,null,null,"沼津・三島","岡崎平野(西三河)",null,null,null,null,"淡路島南部"]
[null,null,null,null,"仙台平野",null,null,null,null,null,null,null,null,null,null,"南魚沼",null,null,null,null,null,null,null,null,null,null,null,null,"大阪平野"]
[null,null,null,null,null,null,null,null,null,null,null,null,null,null,null,"高田平野"]
[]
[null,"北海道",null,"青森県","岩手県","宮城県","秋田県","山形県","福島県","茨城県","栃木県","群馬県","埼玉県","千葉県","東京都","神奈川県","新潟県","富山県","石川県","福井県","山梨県","長野県","岐阜県","静岡県","愛知県","三重県","滋賀県","京都府","大阪府","兵庫県","奈良県","和歌山県","鳥取県","島根県","岡山県","広島県","山口県","徳島県","香川県","愛媛県","高知県","福岡県","佐賀県","長崎県","熊本県","大分県","宮崎県","鹿児島県","沖縄県"]
[null,"石狩平野",null,"青森平野","岩手","石巻地域","象潟・金浦","山形盆地","福島盆地","関東平野","関東平野","関東平野","関東平野","関東平野南部","関東平野南部","関東平野南部","新潟平野","富山・砺波平野","七尾","福井平野","甲府盆地","諏訪盆地","濃尾平野","静岡\n（静清）","濃尾平野","濃尾平野（北勢）","滋賀","京都盆地","大阪平野","豊岡盆地","奈良","和歌山","鳥取平野","島根","岡山平野","広島平野","山口","徳島平野","讃岐平野（高松市周辺）","愛媛","高知平野","筑後・佐賀平野","筑後・佐賀平野","島原半島基部","熊本平野","大分平野","宮崎平野","鹿児島","沖縄"]
[null,"釧路平野",null,"津軽平野",null,"気仙沼",null,"米沢盆地","原町",null,null,null,null,"九十九里平野",null,"県央湘南","長岡",null,"金沢平野",null,null,null,null,"岳南","豊橋平野(東三河)",null,null,null,null,"播磨平野（姫路平野）",null,null,null,null,null,null,null,null,"讃岐平野（丸亀・坂出市周辺）"]
[null,"十勝平野",null,"八戸",null,"古川(仙北平野）",null,null,"いわき",null,null,null,null,null,null,"足柄平野","柏崎",null,null,null,null,null,null,"沼津・三島","岡崎平野(西三河)",null,null,null,null,"淡路島南部"]
[null,null,null,null,null,"仙台平野",null,null,null,null,null,null,null,null,null,null,"南魚沼",null,null,null,null,null,null,null,null,null,null,null,null,"大阪平野"]
[null,null,null,null,null,null,null,null,null,null,null,null,null,null,null,null,"高田平野"]

{"sheet":"ｼｰﾄ1","index":3,"n_rows":30,"n_cols":248,"rows_kept":30,"cut":false,"hidden":false,"merged":[[4,1,4,2],[4,3,4,5],[5,1,5,2],[6,1,6,2],[7,1,7,2],[26,3,26,5],[27,3,27,5],[28,3,28,5],[29,3,29,5],[8,1,8,2],[9,1,9,2],[10,1,10,2],[11,1,11,2],[12,1,24,1],[25,3,25,5]]}
[null,"１　主な水準点における過去10年の沈下量経年変化"]
[1,null,null,null,null,null,null,null,null,null,null,null,null,null,null,null,null,null,null,null,null,null,null,null,null,null,null,null,null,null,null,null,null,null,null,null,null,null,null,null,null,null,null,null,null,null,null,null,null,null,null,null,null,null,null,null,null,null,null,null,null,null,null,null,null,null,null,null,null,null,null,null,null,null,null,null,null,null,null,null,null,null,null,null,null,null,null,null,null,null,null,null,null,null,null,null,null,null,null,null,null,null,null,null,null,null,null,null,null,null,null,null,null,null,null,null,null,null,null,null,null,null,null,null,null,null,null,null,null,null,null,null,null,null,null,null,null,null,null,null,null,null,null,null,null,null,null,null,null,null,null,null,null,null,null,null,null,null,null,null,null,null,null,null,null,null,null,null,null,null,null,null,null,null,null,null,null,null,null,null,null,null,null,null,null,null,null,null,null,null,null,null,null,null,null,null,null,null,null,null,null,null,null,null,null,null,null,null,null,null,null,null,null,null,null,null,null,null,null,null,null,null,null,null,null,null,null,null,null,null,null,null,null,null,null,null,null,null,null,null,null,null,null,1,null,null,null,1]
[{"$f":"IF(COUNTA(D7:F25)<>0,1,2)","v":1},null,null,null,null,null,null,null,null,null,null,null,null,null,null,null,null,null,null,null,null,null,null,null,null,null,null,null,null,null,null,null,null,null,null,null,null,null,null,null,null,null,null,null,null,null,null,null,null,null,null,null,null,null,null,null,null,null,null,null,null,null,null,null,null,null,null,null,null,null,null,null,null,null,null,null,null,null,null,null,null,null,null,null,null,null,null,null,null,null,null,null,null,null,null,null,null,null,null,null,null,null,null,null,null,null,null,null,null,null,null,null,null,null,null,null,null,null,null,null,null,null,null,null,null,null,null,null,null,null,null,null,null,null,null,null,null,null,null,null,null,null,null,null,null,null,null,null,null,null,null,null,null,null,null,null,null,null,null,null,null,null,null,null,null,null,null,null,null,null,null,null,null,null,null,null,null,null,null,null,null,null,null,null,null,null,null,null,null,null,null,null,null,null,null,null,null,null,null,null,null,null,null,null,null,null,null,null,null,null,null,null,null,null,null,null,null,null,null,null,null,null,null,null,null,null,null,null,null,null,null,null,null,null,null,null,null,null,null,null,null,null,null,null,null,null,null,3]
[]
[null,"地域名",null,{"$f":"IF(ｼｰﾄ0!C4=\"\",\"\",ｼｰﾄ0!C3 & (ｼｰﾄ0!C4))","v":"三重県濃尾平野（北勢）"},null,null,null,null,null,null,null,null,null,null,null,null,null,null,null,null,null,null,null,null,null,null,null,null,null,null,null,null,null,null,null,null,null,null,null,null,null,null,null,null,null,null,null,null,null,null,null,null,null,null,null,null,null,null,null,null,null,null,null,null,null,null,null,null,null,null,null,null,null,null,null,null,null,null,null,null,null,null,null,null,null,null,null,null,null,null,null,null,null,null,null,null,null,null,null,null,null,null,null,null,null,null,null,null,null,null,null,null,null,null,null,null,null,null,null,null,null,null,null,null,null,null,null,null,null,null,null,null,null,null,null,null,null,null,null,null,null,null,null,null,null,null,null,null,null,null,null,null,null,null,null,null,null,null,null,null,null,null,null,null,null,null,null,null,null,null,null,null,null,null,null,null,null,null,null,null,null,null,null,null,null,null,null,null,null,null,null,null,null,null,null,null,null,null,null,null,null,null,null,null,null,null,null,null,null,null,null,null,null,null,null,null,null,null,null,null,null,null,null,null,null,null,null,null,null,null,null,null,null,null,null,null,null,null,null,null,null,null,null,null,null,null,null,1]
[null,"区分",null,"①累計沈下量が最大\nの水準点","②直近の測量がR元年～Ｒ５年度の間に行われた水準点のうち、５年間の累計沈下量が最大の水準点","③直近の測量による年間\n沈下量が最大の水準点"]
[null,"水準点番号",null,"C35-16","HR12-1","HR12-1"]
[null,"水準点所在地",null,"三重県桑名市長島町白鶏715","三重県桑名市多度町中須","三重県桑名市多度町中須"]
[null,"所轄機関",null,"国土交通省中部地方整備局","国土交通省中部地方整備局","国土交通省中部地方整備局"]
[null,"測量実施期間",null,"S36～R5","S48～R5","S48～R5"]
[null,"対象期間又は年度",null,"S36～R5","R1～R5","R5"]
[null,"平成25年度以前に実施した\n最終測量年度",null,null,"H23"]
[null,"沈下量(cm)","累計沈下量",163.71,8.2200000000000006,8.2200000000000006]
[null,null,"５年間累計沈下量",null,6.52]
[null,null,"直近単年度最大沈下量",null,null,1.2]
[null,null,"平成26年度",0.73,"再設","再設"]
[null,null,"平成27年度",-0.85,"再設","再設"]
[null,null,"平成28年度",2.66,"再設","再設"]
[null,null,"平成29年度",1.28,"再設","再設"]
[null,null,"平成30年度",-0.89,1.7,1.7]
[null,null,"令和元年度",1.74,1.88,1.88]
[null,null,"令和２年度",0.5,1.58,1.58]
[null,null,"令和３年度",-0.28000000000000003,1.1000000000000001,1.1000000000000001]
[null,null,"令和４年度",0.27,0.76,0.76]
[null,null,"令和５年度",0.45,1.2,1.2]
[null,null,"<備考>","１．沈下量は、基本水準点第３９号（所在地：愛知県豊明市）、準基準水準点第１９１－２号"]
[null,null,null,"（所在地：岐阜県不破郡垂井町）及び新三重原票（所在地：三重県四日市市）を基準とした値"]
[null,null,null,"２．測量の基準日 ： 11月1日"]
[null,null,null,"３．水準点番号（HR12-1）は再設置（H26）しているため、H26～H29を経過観察期間としており"]
[null,null,null,"当該期間は測定値なし。"]

{"sheet":"ｼｰﾄ2","index":4,"n_rows":26,"n_cols":6,"rows_kept":26,"cut":false,"hidden":false,"merged":[[3,1,3,2],[4,1,4,2],[5,1,5,2],[6,1,6,2],[7,1,7,2],[8,1,8,2],[23,3,23,6],[24,3,24,6],[25,3,25,6],[9,1,9,2],[10,1,10,2],[11,1,11,2],[12,1,14,1],[15,1,21,1],[22,3,22,6]]}
[null,"２　代表的な観測井における過去10年の地下水位経年変化"]
[2]
[{"$f":"IF(COUNTA(D5:G22)<>0,1,2)","v":1},"地域名"]
[null,{"$f":"IF(ｼｰﾄ0!C4=\"\",\"\",ｼｰﾄ0!C3   & (ｼｰﾄ0!C4) )","v":"三重県濃尾平野（北勢）"}]
[null,"観測井名称",null,"白鶏","見入","福地"]
[null,"観測井所在地",null,"桑名市長島町白鶏","桑名郡木曽岬町見入","桑名市福地"]
[null,"観測井標高(T.P.m)",null,-0.02,-0.79,-0.01]
[null,"ストレーナー位置\n（地表面下深さ）",null,"140-152","154-175","40-50"]
[null,"所轄機関",null,"三重県","三重県","三重県"]
[null,"地下水の類別",null,"Ｇ３層\n被圧地下水","Ｇ３層\n被圧地下水","Ｇ１層\n被圧地下水"]
[null,"設置年度",null,"昭和51年","昭和51年","昭和57年"]
[null,"既往最低水位",null,"-10.76(S61)","-21.76(S52)","-10.15(S59)"]
[null,null,"平成26年度",-1.58,-1.27,-0.66]
[null,null,"平成27年度",-1.43,-1.04,-0.56000000000000005]
[null,null,"平成28年度",-1.45,-1.1100000000000001,-0.55000000000000004]
[null,"(m)","平成29年度",-1.38,-0.96,-0.54]
[null,null,"平成30年度",-1.35,-0.83,-0.56000000000000005]
[null,null,"令和元年度",-1.31,-2.4900000000000002]
[null,null,"令和２年度",-1.24,-0.76]
[null,null,"令和３年度",-1.22,-0.64]
[null,null,"令和４年度",-1.22,-0.62]
[null,null,"令和５年度",-1,-0.56000000000000005]
[null,null,"<備考>","１．地下水位 ：  水位は、毎日6時、18時の平均水位の年間平均水位"]
[null,null,null,"水位はいずれもTP換算値"]
[null,null,null,"既往最低水位 ： S52観測開始以来の各年の年間平均水位の最低"]
[null,null,null,"福地は令和元年度以降、異常値（令和６年度修繕予定）"]

{"sheet":"ｼｰﾄ3","index":5,"n_rows":94,"n_cols":18,"rows_kept":94,"cut":false,"hidden":false,"merged":[[91,11,91,12],[92,11,92,12],[93,11,93,12],[79,11,79,12],[80,11,80,12],[81,11,81,12],[82,11,82,12],[83,11,83,12],[84,11,84,12],[85,11,85,12],[86,11,86,12],[87,11,87,12],[88,11,88,12],[89,11,89,12],[90,11,90,12],[67,8,67,11],[69,2,69,7],[70,2,70,7],[71,2,71,7],[3,1,3,2],[4,1,6,1],[4,2,6,2],[4,4,4,7],[5,3,6,3],[5,4,6,4],[5,5,6,5],[5,6,6,6],[5,7,6,7],[4,8,4,9],[4,10,4,11]]}
[null,"３　主要地域の地盤沈下等の状況（市区町村別内訳）"]
[2]
[{"$f":"IF(COUNTA(B8:L67)<>0,1,2)","v":1},"地域名"]
[null,{"$f":"IF(ｼｰﾄ0!C4=\"\",\"\",ｼｰﾄ0!C3   & (ｼｰﾄ0!C4) )","v":"三重県濃尾平野（北勢）"}]
[null,"地域内で、過去に地盤沈下が認められた市区町村名をご記入ください。\n※１　　　　　　\n(沈下記録のある市区町村名）\n","左記の市区町村の沈下総面積(㎢)\n（小数第１位まで記入してください。）",null,"左記市区町村※１において、令和５年度水準点測量で1cm以上沈下が生じている沈下量別面積（㎢）",null,null,null,"左記市区町村※１が\n地盤沈下防止等対策要綱の\n地域の場合",null,"左記市区町村※１に関わる\n条例等"]
[null,null,null,"ゼロｍ地帯  面積(㎢)\n（小数第１位まで記入してください。）","1cm/年\n以上","2cm/年\n以上","3cm/年\n以上","4cm/年\n以上","規制地域","観測地域","条例","要項等"]
[null,null,null,null,null,null,null,null,"■","◆","□","◇"]
[{"$f":"IF(COUNTIF(E8:E67,\"/\")>=1,1,\"\")","v":""},"三重県",120,55,null,"　",null,null,"■","◆","□"]
[{"$f":"IF(COUNTIF(E8:E67,\"-\")>=1,2,\"\")","v":2}]
[{"$f":"IF(COUNTIF(E8:E67,\"#\")>=1,4,\"\")","v":4},"桑名郡木曽岬町","#","#","-","-","-","-","■",null,"□"]
[null,"桑名市","#","#","#","-","-","-","■","◆","□"]
[{"$f":"IF(COUNTIF(F8:F67,\"-\")>=1,2,\"\")","v":2},"三重郡朝日町","#","#","-","-","-","-","■","◆","□"]
[{"$f":"IF(COUNTIF(F8:F67,\"/\")>=1,1,\"\")","v":""},"三重郡川越町","#","#","-","-","-","-","■",null,"□",null,null,null,null,null,null,"                                                            "]
[{"$f":"IF(COUNTIF(F8:F67,\"#\")>=1,4,\"\")","v":""},"四日市市","#","#","-","-","-","-","■","◆","□"]
[]
[{"$f":"IF(COUNTIF(G8:G67,\"/\")>=1,1,\"\")","v":""}]
[{"$f":"IF(COUNTIF(G8:G67,\"-\")>=1,2,\"\")","v":2}]
[{"$f":"IF(COUNTIF(G8:G67,\"#\")>=1,4,\"\")","v":""}]
[]
[{"$f":"IF(COUNTIF(H8:H67,\"/\")>=1,1,\"\")","v":""}]
[{"$f":"IF(COUNTIF(H8:H67,\"-\")>=1,2,\"\")","v":2}]
[{"$f":"IF(COUNTIF(H8:H67,\"#\")>=1,4,\"\")","v":""}]
[]
[]
[]
[]
[]
[]
[]
[]
[]
[]
[]
[]
[]
[]
[]
[]
[]
[]
[]
[]
[]
[]
[]
[]
[]
[]
[]
[]
[]
[]
[]
[]
[]
[]
[]
[]
[]
[]
[]
[]
[]
[]
[]
[]
[]
[null,null,{"$f":"IF(COUNTA(C8:C67)<>0,SUM(C8:C67),\"\")","v":120},{"$f":"IF(COUNTA(D8:D67)<>0,SUM(D8:D67),\"\")","v":55},{"$f":"IF(COUNT(E8:E67)>=1,SUM(E8:E67),IF(SUM(A8:A10)=1,\"/\",IF(SUM(A8:A10)=2,\"-\",IF(SUM(A8:A10)=4,\"#\",IF(SUM(A8:A10)=3,\"/ -\",IF(SUM(A8:A10)=5,\"/ #\",IF(SUM(A8:A10)=6,\"- #\",IF(SUM(A8:A10)=7,\"/ - #\",\"\"))))))))","v":"- #"},{"$f":"IF(COUNT(F8:F67)>=1,SUM(F8:F67),IF(SUM(A12:A14)=1,\"/\",IF(SUM(A12:A14)=2,\"-\",IF(SUM(A12:A14)=4,\"#\",IF(SUM(A12:A14)=3,\"/ -\",IF(SUM(A12:A14)=5,\"/ #\",IF(SUM(A12:A14)=6,\"- #\",IF(SUM(A12:A14)=7,\"/ - #\",\"\"))))))))","v":"-"},{"$f":"IF(COUNT(G8:G67)>=1,SUM(G8:G67),IF(SUM(A16:A18)=1,\"/\",IF(SUM(A16:A18)=2,\"-\",IF(SUM(A16:A18)=4,\"#\",IF(SUM(A16:A18)=3,\"/ -\",IF(SUM(A16:A18)=5,\"/ #\",IF(SUM(A16:A18)=6,\"- #\",IF(SUM(A16:A18)=7,\"/ - #\",\"\"))))))))","v":"-"},{"$f":"IF(COUNT(H8:H67)>=1,SUM(H8:H67),IF(SUM(A20:A22)=1,\"/\",IF(SUM(A20:A22)=2,\"-\",IF(SUM(A20:A22)=4,\"#\",IF(SUM(A20:A22)=3,\"/ -\",IF(SUM(A20:A22)=5,\"/ #\",IF(SUM(A20:A22)=6,\"- #\",IF(SUM(A20:A22)=7,\"/ - #\",\"\"))))))))","v":"-"},{"$f":"IF($I$80=0,\"\",VLOOKUP($I$80,$K$80:$L$94,2,FALSE))","v":"■ ◆ □"}]
[null,null,"<備考>"]
[]
[]
[]
[]
[]
[]
[]
[]
[]
[null,null,null,null,"■","◆","□","◇"]
[null,null,null,null,{"$f":"IF(COUNTA($I$8:$I$67)=0,0,1)","v":1},{"$f":"IF(COUNTA($J$8:$J$67)=0,0,2)","v":2},{"$f":"IF(COUNTA($K$8:$K$67)=0,0,4)","v":4},{"$f":"IF(COUNTA($L$8:$L$67)=0,0,8)","v":0},{"$f":"SUM($E$80:$H$80)","v":7},null,1,"■"]
[null,null,null,null,null,null,null,null,null,null,2,"◆"]
[null,null,null,null,null,null,null,null,null,null,3,"■ ◆ "]
[null,null,null,null,null,null,null,null,null,null,4,"□"]
[null,null,null,null,null,null,null,null,null,null,5,"■ □"]
[null,null,null,null,null,null,null,null,null,null,6,"◆ □ "]
[null,null,null,null,null,null,null,null,null,null,7,"■ ◆ □"]
[null,null,null,null,null,null,null,null,null,null,8,"◇"]
[null,null,null,null,null,null,null,null,null,null,9,"■ ◇"]
[null,null,null,null,null,null,null,null,null,null,10,"◆ ◇ "]
[null,null,null,null,null,null,null,null,null,null,11,"■ ◆ ◇"]
[null,null,null,null,null,null,null,null,null,null,12,"□ ◇"]
[null,null,null,null,null,null,null,null,null,null,13,"■ □ ◇"]
[null,null,null,null,null,null,null,null,null,null,14,"◆ □ ◇"]
[null,null,null,null,null,null,null,null,null,null,15,"■ ◆ □ ◇"]

{"sheet":"ｼｰﾄ4","index":6,"n_rows":13,"n_cols":13,"rows_kept":13,"cut":false,"hidden":false,"merged":[[3,1,6,1],[3,12,6,12],[4,2,4,8],[4,9,4,10],[4,11,6,11],[5,2,5,3],[5,4,5,8],[5,9,6,9],[5,10,6,10],[3,2,3,11]]}
[null,"４　水位低下等による被害の状況"]
[1]
[{"$f":"IF(COUNTA(C8:L8)<>0,1,2)","v":1}]
[null,"地　域","被　害　別　対　策　状　況",null,null,null,null,null,null,null,null,null,"被害に対する対策状況"]
[null,null,"直　　接　　被　　害",null,null,null,null,null,null,"間接被害",null,"地下水の塩水化"]
[null,null,"一般施設",null,"公　共　施　設",null,null,null,null,"洪水・高潮の危険性大","排水不良"]
[null,null,"建築物の破損または脆弱化","井戸等の抜け上がり","港湾・海岸施設の沈下　　　　　　","堤防・護岸等の沈下","道路・橋梁等の沈下・破損","農業用水路の沈下・破損","埋設物の破損"]
[null,{"$f":"IF(ｼｰﾄ0!C4=\"\",\"\",ｼｰﾄ0!C3&ｼｰﾄ0!C4)","v":"三重県濃尾平野（北勢）"},null,"○","○","○",null,"○","○","○","○","○"]
[]
[null,"<記載の注意点>","●：これまでに発生したすべての被害について、令和５年度に対策を行い、被害が解消された。（令和４年度までに、すべての対策が終了していれば「（空欄）」になります。）"]
[null,null,"○ ：令和５年度末時点において、過去の被害も含め一部対策を行っている。（すべての被害について対策が終了していない場合）"]
[null,null,"△ ：令和５年度末時点において、過去の被害も含め対策は行っていない。（被害の大小に関係なくご記入願います。）"]
[null,null,"（空欄）：「令和５年度に新たな被害が認められない場合」又は「令和４年度までに、これまでに発生したすべての被害について対策済みである場合」"]

{"sheet":"ｼｰﾄ5","index":7,"n_rows":25,"n_cols":8,"rows_kept":25,"cut":false,"hidden":false,"merged":[[4,3,4,7],[4,2,5,2],[4,1,5,1],[14,1,15,1],[6,2,7,2],[8,2,9,2],[10,2,11,2],[12,2,13,2],[6,1,13,1],[18,3,18,5],[18,6,19,6],[24,1,24,2],[18,1,19,1],[18,2,19,2],[20,1,23,1]]}
[null,null,"５　地盤沈下監視体制（水準測量、観測井戸数）"]
[2]
[{"$f":"IF(COUNTA(D7:H14)<>0,1,2)","v":1}]
[]
[null,"地域名","観測機関\n（事業主体）","水準測量"]
[null,null,null,"測量距離\n（㎞）","測量面積\n（㎢）","水準点数\n（点）","水準測量\n（一級・二級）","測量基準日"]
[null,{"$f":"IF(OR(ｼｰﾄ0!C4=\"\",ｼｰﾄ0!C3=\"\"),\"\",ｼｰﾄ0!C3&ｼｰﾄ0!C4)","v":"三重県濃尾平野（北勢）"},"自治体\n（都道府県・指定都市）",43,null,46,"一級水準測量","2023-11-01"]
[]
[null,null,"管内市町村"]
[]
[null,null,"国\n（ 国交省、農林省、\n国土地理院等 ）",85,null,29,"一級水準測量","2023-11-01"]
[null,null,null,41,null,29,"一級水準測量","2023-11-01"]
[null,null,"その他　　　　　　　　",18,null,26,"一級水準測量","2023-11-01"]
[]
[null,"合　　　計","一級水準測量",{"$f":"IF(COUNTA(D7:D14)=0,\"\",SUMIFS(D7:D14,$G$7:$G$14,$C$15))","v":187},{"$f":"IF(COUNTA(E7:E14)=0,\"\",SUMIFS(E7:E14,$G$7:$G$14,$C$15))","v":""},{"$f":"IF(COUNTA(F7:F14)=0,\"\",SUMIFS(F7:F14,$G$7:$G$14,$C$15))","v":130}]
[null,null,"二級水準測量",{"$f":"IF(COUNTA(D7:D14)=0,\"\",SUMIFS(D7:D14,$G$7:$G$14,$C$16))","v":0},{"$f":"IF(COUNTA(E7:E14)=0,\"\",SUMIFS(E7:E14,$G$7:$G$14,$C$16))","v":""},{"$f":"IF(COUNTA(F7:F14)=0,\"\",SUMIFS(F7:F14,$G$7:$G$14,$C$16))","v":0}]
[]
[]
[null,"地域名","観測機関\n（事業主体）","観測井戸数（本）",null,null,"観測井戸数合計\n（本）"]
[null,null,null,"地下水位のみ\n観測井戸数(本）","地盤収縮のみ\n観測井戸数（本）","地下水位及び\n地盤収縮\n観測井戸数（本）"]
[null,{"$f":"IF(OR(ｼｰﾄ0!C4=\"\",ｼｰﾄ0!C3=\"\"),\"\",ｼｰﾄ0!C3&ｼｰﾄ0!C4)","v":"三重県濃尾平野（北勢）"},"自治体\n（都道府県・指定都市）",16,null,1,{"$f":"IF(COUNTA(D21:F21)=0,\"\",SUM(D21:F21))","v":17}]
[null,null,"管内市町村",null,null,null,{"$f":"IF(COUNTA(D22:F22)=0,\"\",SUM(D22:F22))","v":""}]
[null,null,"国\n（ 国交省、農林省、\n国土地理院等 ）",null,null,4,{"$f":"IF(COUNTA(D23:F23)=0,\"\",SUM(D23:F23))","v":4}]
[null,null,"その他",null,null,null,{"$f":"IF(COUNTA(D24:F24)=0,\"\",SUM(D24:F24))","v":""}]
[null,"合　　　計　（本数）",null,{"$f":"IF(SUM(D21:D24)=0,\"\",SUM(D21:D24))","v":16},{"$f":"IF(SUM(E21:E24)=0,\"\",SUM(E21:E24))","v":""},{"$f":"IF(SUM(F21:F24)=0,\"\",SUM(F21:F24))","v":5},{"$f":"IF(SUM(G21:G24)=0,\"\",SUM(G21:G24))","v":21}]

{"sheet":"ｼｰﾄ6","index":8,"n_rows":70,"n_cols":19,"rows_kept":70,"cut":false,"hidden":false,"merged":[[54,2,59,2],[3,1,5,1],[18,2,23,2],[24,2,29,2],[42,2,47,2],[54,1,59,1],[18,1,23,1],[24,1,29,1],[42,1,47,1],[3,2,5,2],[48,1,53,1],[12,1,17,1],[6,1,11,1],[30,1,35,1],[36,1,41,1],[12,2,17,2],[68,3,71,3],[69,4,69,12],[70,4,70,12],[71,4,71,12],[61,13,61,18],[62,13,62,18],[63,13,63,18],[64,13,64,18],[65,13,65,18],[68,4,68,12],[6,2,11,2],[48,2,53,2],[30,2,35,2],[36,2,41,2],[3,3,5,3]]}
[null,"６　地域別、用途別、井戸本数及び地下水採取量経年変化"]
[1]
[{"$f":"IF(COUNTA(E7:P11)<>0,1,2)","v":1}]
[null,"地域名","地区名","用　途","令和元年度",null,null,"令和2年度",null,null,"令和3年度",null,null,"令和4年度",null,null,"令和５年度"]
["　",null,null,null,"井戸\n本数","採取量",null,"井戸\n本数","採取量",null,"井戸\n本数","採取量",null,"井戸\n本数","採取量",null,"井戸\n本数","採取量"]
[null,null,null,null,"本","千㎥/日","百万\n㎥/年","本","千㎥/日","百万\n㎥/年","本","千㎥/日","百万\n㎥/年","本","千㎥/日","百万\n㎥/年","本","千㎥/日","百万\n㎥/年"]
[null,{"$f":"ｼｰﾄ0!$C$4","v":"濃尾平野（北勢）"},"県条例一号地域","工業用",93,3.8356164383561642,1.4,93,3.8,1.4,93,3.3,1.2,86,1.8410958904109589,0.67200000000000004]
[null,null,null,"建築物用",17,0,0,17,0,0,17,0,0,17,0,0]
[null,null,null,"上水道用",3,1.6438356164383561,0.6,3,1.7,0.6,3,1.7589041095890412,0.64200000000000002,3,1.8438356164383563,0.67300000000000004]
[null,null,null,"農業用",60,1.9178082191780823E-2,7.0000000000000001E-3,58,0.03,1.2999999999999999E-2,58,0,0,57,0.12876712328767123,4.7E-2]
[null,null,null,"その他",232,17.260273972602739,6.3,229,17.600000000000001,6.4,229,17.44109589041096,6.3659999999999997,226,6.3287671232876708,2.31]
[null,null,null,"①　計",{"$f":"IF(COUNT(E7:E11)>=1,SUM(E7:E11),\"\")","v":405},{"$f":"IF(COUNT(F7:F11)>=1,SUM(F7:F11),\"\")","v":22.758904109589039},8.3070000000000004,{"$f":"IF(COUNT(H7:H11)>=1,SUM(H7:H11),\"\")","v":400},{"$f":"IF(COUNT(I7:I11)>=1,SUM(I7:I11),\"\")","v":23.130000000000003},8.4130000000000003,{"$f":"IF(COUNT(K7:K11)>=1,SUM(K7:K11),\"\")","v":400},{"$f":"IF(COUNT(L7:L11)>=1,SUM(L7:L11),\"\")","v":22.5},8.2080000000000002,389,{"$f":"IF(COUNT(O7:O11)>=1,SUM(O7:O11),\"\")","v":10.142465753424657},3.702,"","",""]
[null,{"$f":"ｼｰﾄ0!$C$4","v":"濃尾平野（北勢）"},"県条例二号地域","工業用",29,1.9178082191780821,0.7,29,1.8,0.7,27,1.7315068493150685,0.63200000000000001,25,1.8904109589041096,0.69]
[null,null,null,"建築物用",5,0,0,5,0,0,5,0,0,5,0,0]
[null,null,null,"上水道用",5,1.3698630136986301,0.5,5,1.9,0.7,5,2.043835616438356,0.746,5,2.6273972602739728,0.95899999999999996]
[null,null,null,"農業用",4,0.27397260273972601,0.1,4,0.2,0.1,4,0.4,0.1,5,0.38356164383561642,0.14000000000000001]
[null,null,null,"その他",38,0.82191780821917804,0.3,38,0.9,0.3,38,0.9,0.3,43,1.2520547945205478,0.45700000000000002]
[null,null,null,"②　計",{"$f":"IF(COUNT(E13:E17)>=1,SUM(E13:E17),\"\")","v":81},4.3835616438356162,1.6,81,4.8000000000000007,1.8,79,5.0753424657534252,1.7780000000000002,83,6.1534246575342468,2.246,"","",""]
[null,{"$f":"ｼｰﾄ0!$C$4","v":"濃尾平野（北勢）"},null,"工業用"]
[null,null,null,"建築物用"]
[null,null,null,"上水道用"]
[null,null,null,"農業用"]
[null,null,null,"その他"]
[null,null,null,"③　計",{"$f":"IF(COUNT(E19:E23)>=1,SUM(E19:E23),\"\")","v":""},"","","","","","","","","","","","","",""]
[null,{"$f":"ｼｰﾄ0!$C$4","v":"濃尾平野（北勢）"},null,"工業用"]
[null,null,null,"建築物用"]
[null,null,null,"上水道用"]
[null,null,null,"農業用"]
[null,null,null,"その他"]
[null,null,null,"④　計",{"$f":"IF(COUNT(E25:E29)>=1,SUM(E25:E29),\"\")","v":""},"","","","","","","","","","","","","",""]
[null,{"$f":"ｼｰﾄ0!$C$4","v":"濃尾平野（北勢）"},null,"工業用"]
[null,null,null,"建築物用"]
[null,null,null,"上水道用"]
[null,null,null,"農業用"]
[null,null,null,"その他"]
[null,null,null,"⑤　計",{"$f":"IF(COUNT(E31:E35)>=1,SUM(E31:E35),\"\")","v":""},"","","","","","","","","","","","","",""]
[null,{"$f":"ｼｰﾄ0!$C$4","v":"濃尾平野（北勢）"},null,"工業用"]
[null,null,null,"建築物用"]
[null,null,null,"上水道用"]
[null,null,null,"農業用"]
[null,null,null,"その他"]
[null,null,null,"⑥　計",{"$f":"IF(COUNT(E37:E41)>=1,SUM(E37:E41),\"\")","v":""},"","","","","","","","","","","","","",""]
[null,{"$f":"ｼｰﾄ0!$C$4","v":"濃尾平野（北勢）"},null,"工業用"]
[null,null,null,"建築物用"]
[null,null,null,"上水道用"]
[null,null,null,"農業用"]
[null,null,null,"その他"]
[null,null,null,"⑦　計",{"$f":"IF(COUNT(E43:E47)>=1,SUM(E43:E47),\"\")","v":""},"","","","","","","","","","","","","",""]
[null,{"$f":"ｼｰﾄ0!$C$4","v":"濃尾平野（北勢）"},null,"工業用"]
[null,null,null,"建築物用"]
[null,null,null,"上水道用"]
[null,null,null,"農業用"]
[null,null,null,"その他"]
[null,null,null,"⑧　計",{"$f":"IF(COUNT(E49:E53)>=1,SUM(E49:E53),\"\")","v":""},{"$f":"IF(COUNT(F49:F53)>=1,SUM(F49:F53),\"\")","v":""},"","","","","","","","","","","","",""]
[null,"地域\n合計",null,"工業用",{"$f":"IF(COUNT(E7,E13,E19,E25,E31,E37,E43,E49)>=1,SUM(E7,E13,E19,E25,E31,E37,E43,E49),\"\")","v":122},5.7534246575342465,2.0999999999999996,122,5.6,2.0999999999999996,120,5.0315068493150683,1.8319999999999999,111,3.7315068493150685,1.3620000000000001,"","",""]
[null,null,null,"建築物用",{"$f":"IF(COUNT(E8,E14,E20,E26,E32,E38,E44,E50)>=1,SUM(E8,E14,E20,E26,E32,E38,E44,E50),\"\")","v":22},0,0,22,0,0,22,0,0,22,0,0,"","",""]
[null,null,null,"上水道用",{"$f":"IF(COUNT(E9,E15,E21,E27,E33,E39,E45,E51)>=1,SUM(E9,E15,E21,E27,E33,E39,E45,E51),\"\")","v":8},3.0136986301369859,1.1000000000000001,8,3.5999999999999996,1.2999999999999998,8,3.8027397260273972,1.3879999999999999,8,4.4712328767123291,1.6320000000000001,"","",""]
[null,null,null,"農業用",{"$f":"IF(COUNT(E10,E16,E22,E28,E34,E40,E46,E52)>=1,SUM(E10,E16,E22,E28,E34,E40,E46,E52),\"\")","v":64},0.29315068493150681,0.10700000000000001,62,0.23,0.113,62,0.4,0.1,62,0.51232876712328768,0.187,"","",""]
[null,null,null,"その他",{"$f":"IF(COUNT(E11,E17,E23,E29,E35,E41,E47,E53)>=1,SUM(E11,E17,E23,E29,E35,E41,E47,E53),\"\")","v":270},18.082191780821919,6.6,267,18.5,6.7,267,18.341095890410958,{"$f":"IF(COUNT(M11,M17,M23,M29,M35,M41,M47,M53)>=1,SUM(M11,M17,M23,M29,M35,M41,M47,M53),\"\")","v":6.6659999999999995},269,7.580821917808219,2.7669999999999999,"","",""]
[null,null,null,"地域の\n合計",{"$f":"SUM(E55:E59)","v":486},27.142465753424659,9.907,481,27.93,10.212999999999999,479,27.575342465753423,9.9859999999999989,472,16.295890410958904,5.9480000000000004,0,0,0]
[]
[null,null,"備考欄",null,null,null,"調査名：","例：県条例による地下水採取量　届け出書"]
[null,null,null,"工業用","三重県生活環境の保全に関する条例及び工業用水法による採取量報告の集計。"]
[null,null,null,"建築物用","三重県生活環境の保全に関する条例及び工業用水法による採取量報告の集計。"]
[null,null,null,"上水道用","三重県生活環境の保全に関する条例及び工業用水法による採取量報告の集計。"]
[null,null,null,"農業用","三重県生活環境の保全に関する条例及び工業用水法による採取量報告の集計。"]
[]
[null,null,null,"例：　消雪用、融雪用、養魚用、温泉などを含む"]
[null,null,null,"その他（内訳）","温泉用、水産養殖用などを含む"]
[null,null,null,null,"・日当たり採取量は、年間採取量を暦日で割ったもの。 \n・対象設備は、吐出口断面積が６cm2以上の揚水設備。（採取量報告のあった設備） \n・条例２号規制地域の採取量には、工業用水法規制地域の採取量を含む。\n・令和５年度は集計中。"]

{"sheet":"目次 (2)","index":9,"n_rows":56,"n_cols":6,"rows_kept":56,"cut":false,"hidden":false,"merged":[[0,0,0,1],[0,3,0,5],[1,0,1,1]]}
["　＜詳細データ目次＞",null,null,"旧  ＜詳細データ目次＞　"]
["地盤沈下等の概況",null,null,"１．地盤沈下等の概況"]
["１．","地盤環境情報（概要、地下水採取の状況、地盤沈下等の状況、被害、対策）"]
["２．","主な水準点における過去10年の沈下量経年変化",null,null,"１－１．","主な水準点における過去10年の沈下量経年変化"]
["３．","代表的な観測井における過去10年の地下水位経年変化",null,null,"１－２．","代表的な観測井における過去10年の地下水位経年変化"]
["４．","主要地域の地盤沈下等の状況（市町村別内訳）",null,null,"１－３．","地盤沈下地域の面積"]
["５．","水位低下等による被害の状況",null,null,"１－４．","水位低下等による被害の状況"]
["６．","地盤沈下監視体制（水準測量、観測井戸数）",null,null,"２－１．","地盤沈下監視体制（水準測量）"]
["７．","地区別、用途別、井戸本数及び地下水採取量経年変化",null,null,"５－２．","工業用水法第５条第２項の適用状況"]
["８．","地下水採取規制に関する条例等"]
[null,null,null,null,"５－５．","工業用水法第10条第３項に基づく届出書受理状況"]
["用水二法の施行状況",null,null,"３．関連制度の状況"]
["７．","工業用水法第３条第１項及び第７条第１項の許可状況",null,null,"３－１．","関連制度の種類"]
["８．","工業用水法第５条第２項の適用状況",null,null,"３－２．","関連制度の経緯及び改定等の内容"]
["９．","工業用水法第６条第３項に基づく届出書受理状況",null,null,"３－３．","関連制度の内容（法律）"]
["１０．","工業用水法第９条に基づく届出書受理状況",null,null,"３－４．","関連制度の内容（条例）"]
["１１．","工業用水法第10条第３項に基づく届出書受理状況",null,null,"３－５．","関連制度の内容（要綱）"]
["１２．","工業用水法第11条に基づく届出書受理状況",null,null,"３－６．","関連制度の内容（その他）"]
["１３．","工業用水法第24条の規定に基づく許可井戸の変更報告状況",null,"４．地下水・地盤沈下対策の状況"]
["１４．","工業用水法第24条の規定に基づく井戸使用状況報告",null,null,"４－１．","地下水採取量の用途別削減量"]
["１５．","ビル用水法第４条第１項の許可状況",null,null,"４－２．","合理化施策による地下水採取削減量"]
["１６．","ビル用水法第４条第３項の適用状況",null,null,"４－３．","代替水対策による地下水採取削減量"]
["１７．","ビル用水法第６条第３項に基づく届出書受理状況",null,null,"４－４．","地盤沈下対策事業及び調査事業費の推移"]
["１８．","ビル用水法第７条に基づく届出書受理状況",null,null,"４－５．","地盤沈下対策事業（代替水事業）の内容"]
["１９．","ビル用水法第８条第３項に基づく届出書受理状況",null,null,"４－６．","地盤沈下対策事業（防災事業等）の内容"]
["２０．","ビル用水法第９条に基づく届出書受理状況",null,null,"４－７．","調査等事業の内容"]
["２１．","ビル用水法第13条の規定に基づく許可井戸の変更報告状況",null,null,"４－８．","地下水・地盤環境保全施策の組織"]
["２２．","ビル用水法第13条の規定に基づく井戸使用状況報告",null,"５．用水二法の施行状況"]
[null,null,null,null,"５－６．","工業用水法第11条に基づく届出書受理状況"]
[null,null,null,null,"５－７．","工業用水法第24条の規定に基づく許可井戸の変更報告状況"]
[null,null,null,null,"５－８．","工業用水法第24条の規定に基づく井戸使用状況報告"]
[null,null,null,null,"５－９．","ビル用水法第４条第１項の許可状況"]
[null,null,null,null,"５－10．","ビル用水法第４条第３項の適用状況"]
[null,null,null,null,"５－11．","ビル用水法第６条第３項に基づく届出書受理状況"]
[null,null,null,null,"５－12．","ビル用水法第７条に基づく届出書受理状況"]
[null,null,null,null,"５－13．","ビル用水法第８条第３項に基づく届出書受理状況"]
[null,null,null,null,"５－14．","ビル用水法第９条に基づく届出書受理状況"]
[null,null,null,null,"５－15．","ビル用水法第13条の規定に基づく許可井戸の変更報告状況"]
[null,null,null,null,"５－16．","ビル用水法第13条の規定に基づく井戸使用状況報告"]
[null,null,null,"６．地下水の利用状況"]
[null,null,null,null,"６－１．","地区別、用途別、井戸本数及び地下水採取量経年変化"]
[null,null,null,null,"６－２．","地下水採取量等の調査の内容"]
[null,null,null,null,"６－３．","地下水の月別採取量"]
[null,null,null,null,"６－４．","特定用途の地下水採取量（天然ガスかん水）"]
[null,null,null,null,"６－５．","特定用途の地下水採取量（温泉水）"]
[null,null,null,null,"６－６．","特定用途の地下水採取量（農業用水）"]
[null,null,null,null,"６－７．","特定用途の地下水採取量（道路消雪用水）"]
[null,null,null,"７．その他"]
[null,null,null,null,"７－１．","健全な水循環の確保に向けての取組みに関する調査（地下水保全計画等を含む）"]
[null,null,null,null,"７－２．","地盤環境に係る情報システムの整備状況"]
[null,null,null,null,"７－３．","地盤環境に係る情報開示の状況"]
[null,null,null,null,"７－４．","アンケート"]
[]
[null,null,null,null,null,"：ピンク色の項目群が調査依頼の対象外としました。"]
[]
[null,null,null,"※ 地域により該当のデータがない場合があります。"]

{"sheet":"ｼｰﾄ7","index":10,"n_rows":25,"n_cols":17,"rows_kept":25,"cut":false,"hidden":false,"merged":[[3,7,3,8],[3,9,3,11],[3,16,4,16],[3,12,4,12],[3,13,4,13],[3,14,4,14],[3,15,4,15],[3,4,4,4],[3,5,3,6],[9,1,9,2],[3,1,4,1],[3,2,4,2],[3,3,4,3]]}
[1]
[{"$f":"IF(COUNTA(B6:Q9)<>0,1,2)","v":1},"７　工業用水法第３条第１項および第７条第１項の許可状況"]
[]
[null,"番　号","受理日","氏名\n（名称）","井戸の\n設置場所","ｽﾄﾚｰﾅｰの位置\n（地表面下ｍ）",null,"揚水機の吐出口\n断面積　(㎠）",null,"採取量(㎥）",null,null,"主たる\n用途","業　種","許可理由","許可\n年月日","許可番号"]
[null,null,null,null,null,"許可\n内容","許可\n基準","許可\n内容","許可\n基準","１時間当り\n採取量","１日当り\n運転時間","１日当り\n採取量"]
[null,"A-0108","1974-01-21","第一工業製薬㈱\n四日市工場\n千歳地区","四日市市\n千歳町7番地","232～254.5\n259～266.5\n290～320","230m以深",45.6,"46cm2\n以下",31.1,18,560,"冷却用\n洗浄用","化学","許可基準に適合","1974-03-19","49井四\n第108号"]
[null,"A-0105","1973-09-10","キンセイマテック㈱\n四日市工場","四日市市\n河原田町森\n1750番地","102～105.5\n110.5～118.5\n122.5～144.5","50m\n以深",20.257000000000001,"21cm2\n以下",15,24,360,"洗浄用","窯業","許可基準に適合","1973-09-17","48井四\n第105号"]
[null,"A-0109","1974-03-14","㈱三東工業所\n本社事業所","四日市市\n河原田町松本\n1333の1","107～111\n116～127\n132～138","50m\n以深",20.420000000000002,"21cm2\n以下",15,8,120,"洗浄用\n冷却用","建設","許可基準に適合","1974-03-27","49井四\n第109号"]
[null,"A-0110","1974-07-30","中島製茶㈱","四日市市追分\n2丁目1番11号","101.5ｍ以深","50m\n以深",20.3,"21cm2\n以下",10.8,24,260,"冷蔵庫用","製茶","許可基準に適合","1974-08-06","49井四\n第110号"]
[null,"計",null,null,null,null,null,null,null,{"$f":"IF(AND(OR(ISBLANK(J6),ISTEXT(J6))=TRUE,OR(ISBLANK(#REF!),ISTEXT(#REF!))=TRUE),\"\",CONCATENATE(SUM(J6:J9),\"㎥\"))","v":"71.9㎥"},{"$f":"IF(AND(OR(ISBLANK(K6),ISTEXT(K6))=TRUE,OR(ISBLANK(#REF!),ISTEXT(#REF!))=TRUE),\"\",CONCATENATE(SUM(K6:K9),\"時間\"))","v":"74時間"},{"$f":"IF(AND(OR(ISBLANK(L6),ISTEXT(L6))=TRUE,OR(ISBLANK(#REF!),ISTEXT(#REF!))=TRUE),\"\",CONCATENATE(SUM(L6:L9),\"㎥\"))","v":"1300㎥"}]
[]
[]
[]
[]
[]
[]
[]
[]
[]
[]
[]
[]
[]
[]
[null,null,null,null,null,null,"   "]

{"sheet":"ｼｰﾄ8","index":11,"n_rows":28,"n_cols":17,"rows_kept":28,"cut":false,"hidden":false,"merged":[[3,1,4,1],[3,2,4,2],[3,3,4,3],[3,4,4,4],[3,16,4,16],[3,8,3,9],[3,10,3,11],[3,5,4,5],[3,12,4,12],[3,13,4,13],[3,14,4,14],[3,6,3,7],[3,15,4,15]]}
[1]
[{"$f":"IF(COUNTA(B6:Q27)<>0,1,2)","v":1},"８　工業用水法第５条第２項の適用状況"]
[]
[null,"番　号","受理日","氏名\n（名称）","井戸の\n設置場所","井戸の\n設置年月日","ｽﾄﾚｰﾅｰの位置\n（地表面下ｍ）",null,"揚水機の吐出口\n断面積 (㎠)",null,"採取量 (㎥/日)",null,"主たる\n用途","業　種","許可理由","許可\n年月日","許可\n番号"]
[null,null,null,null,null,null,"許可\n内容","許可\n基準","許可\n内容","許可\n基準","許可前","許可"]
[null,"A-0001","2023-02-16","コスモ石油㈱\n四日市製油所","四日市市\n大協町\n一丁目1番地",null,"105～110\n115～120\n135～144\n168～178",null,176.7,null,1000,"1,000\n(4～9月)\n400\n(10～3月)","冷却用","石油","潤滑油製造過程の冷却水として必要","2023-02-28","５井四\n第1号"]
[null,"A-0002","2023-02-16","コスモ石油㈱\n四日市製油所","四日市市\n大協町\n一丁目1番地",null,"92～105\n122～126\n145～160\n165～175",null,176.7,null,800,"800\n(4～9月)\n350\n(10～3月)","冷却用","石油","潤滑油製造過程の冷却水として必要","2023-02-28","５井四\n第2号"]
[null,"A-0008","2023-02-16","伊藤製油㈱","四日市市\n末広町13-26",null,"95～108\n135～145",null,33.17,null,500,"500\n(5～10月)\n230\n(11～4月)","冷却用","油脂","食用油精製過程の冷却水に必要","2023-02-28","５井四\n第8号"]
[null,"A-0022","2023-02-09","コスモ電子㈱","四日市市\n宝町1番地",null,"二重ケーシング\n121～129\n136～148",null,50.2,null,1960,900,"温調用","電子","機器製造における温調用の恒温水に必要","2023-02-28","５井四\n第22号"]
[null,"A-0024","2023-02-09","コスモ電子㈱","四日市市\n宝町1番地",null,"49～54\n68～85\n98～106\n123～129",null,81.099999999999994,null,860,350,"温調用","電子","機器製造における温調用の恒温水に必要","2023-02-28","５井四\n第24号"]
[null,"A-0067","2023-03-02","JSR㈱四日市工場","四日市市川尻町\n100番地",null,"124.5～136.5",null,81.03,null,null,null,"保安用","化学","保安用に必要","2023-03-03","５井四\n第67号"]
[null,"A-0071","2023-03-02","JSR㈱四日市工場","四日市市川尻町\n100番地",null,"134～155.4\n161.5～173.8",null,78.5,null,null,null,"保安用","化学","保安用に必要","2023-03-03","５井四\n第71号"]
[null,"A-0040","2023-02-14","東洋紡㈱\n三重工場","四日市市\n楠町本郷30番地",null,"95.0～105.0\n110.6～117.0\n120.1～133.3",null,78.5,null,1600,1300,"温調用","紡績","温調用の恒温水として必要","2023-02-28","５井四\n第40号"]
[null,"A-0042","2023-02-14","東洋紡㈱\n三重工場","四日市市\n楠町本郷30番地",null,"旧ケーシング\n95.4～106.0\n111.8～115.7\n121.2～125.7\n127.9～129.4\n129.9～131.5\n二重ケーシング\n95.4～106.0",null,78.5,null,1600,1440,"温調用","紡績","温調用の恒温水として必要","2023-02-28","５井四\n第42号"]
[null,"A-0044","2023-02-14","東洋紡㈱\n三重工場","四日市市\n楠町本郷30番地",null,"37.9～41.0\n42.4～46.0\n49.1～52.1\n53.0～56.1\n57.6～65.1\n67.6～70.6",null,122.7,null,400,1500,"温調用","紡績","温調用の恒温水として必要","2023-02-28","５井四\n第44号"]
[null,"A-0045","2023-02-14","東洋紡㈱\n三重工場","四日市市\n楠町本郷30番地",null,"40.0～42.7\n47.9～62.7\n75.1～80.6\n84.5～87.9\n92.1～100.0",null,122.7,null,1000,"1,900\n(5～10月)\n1,200\n(11～4月)","温調用","紡績","温調用の恒温水として必要","2023-02-28","３井四\n第45号"]
[null,"A-0046","2023-02-01","㈱宮﨑本店","四日市市楠町\n南五味塚937",null,"123～140",null,45.6,null,350,350,"原料用\n他","酒造","酒造の原材料･洗浄･冷却水として必要","2023-02-28","５井四\n第46号"]
[null,"A-0048","2023-02-01","㈱宮﨑本店","四日市市楠町\n南五味塚928",null,"95～111\n125～136",null,81,null,700,700,"原料用\n他","酒造","酒造の原材料･洗浄･冷却水として必要","2023-02-28","５井四\n第48号"]
[null,"A-0049","2023-01-30","宝酒造㈱楠工場","四日市市楠町南五味塚1315",null,"81～87\n92～108\n121～135",null,78.5,null,800,800,"原料用\n他","酒造","酒造の原材料･洗浄･冷却水として必要","2023-02-28","５井四\n第49号"]
[null,"A-0050","2023-01-30","宝酒造㈱楠工場","四日市市楠町南五味塚1315",null,"73～77\n79～85\n89～96\n103～113\n121～124\n142～147\n170～173\n196～206",null,122.7,null,1050,1050,"原料用\n他","酒造","酒造の原材料･洗浄･冷却水として必要","2023-02-28","５井四\n第50号"]
[null,"A-0051","2023-01-30","宝酒造㈱楠工場","四日市市楠町南五味塚1315",null,"51～61\n64～67\n76～82\n98～102\n106～111\n120～135\n145～150\n152～154",null,50.3,null,750,750,"原料用\n他","酒造","酒造の原材料･洗浄･冷却水として必要","2023-02-28","５井四\n第51号"]
[null,"A-0052","2023-02-24","トーア紡\nマテリアル㈱\n四日市工場","四日市市楠町\n南川50",null,"55.0～66.0\n68.0～84.0\n96.0～108.0\n127.0～138.0\n145.0～149.0",null,201,null,2400,2400,"染色用","紡績","温調用の恒温水として必要","2023-02-28","５井四\n第52号"]
[null,"A-0053","2023-02-24","トーア紡\nマテリアル㈱\n四日市工場","四日市市楠町\n南川50",null,"48.4～60.8\n81.0～83.7\n85.0～90.4",null,78.5,null,120,120,"染色用","紡績","温調用の恒温水として必要","2023-02-28","５井四\n第53号"]
[null,"A-0054","2023-02-24","トーア紡\nマテリアル㈱\n四日市工場","四日市市楠町\n南川50",null,"49.7～58.2\n60.8～66.0\n76.5～79.4\n85.8～89.4\n97.3～108.8\n118.9～129.8\n139.0～148.7",null,132.69999999999999,null,2040,"2,040\n(5～10月)\n940\n(11～4月)","温調用","紡績","温調用の恒温水として必要","2023-02-28","５井四\n第54号"]
[null,"A-0056","2023-02-24","トーア紡\nマテリアル㈱\n四日市工場","四日市市楠町\n南川50",null,"60.8～69.0\n78.6～114.0",null,132.69999999999999,null,2040,"2,040\n(5～10月)\n1,540\n(11～4月)","温調用","紡績","温調用の恒温水として必要","2023-02-28","５井四\n第56号"]
[null,"A-0057","2023-02-24","トーア紡\nマテリアル㈱\n四日市工場","四日市市楠町\n南川50",null,"94.2～110.9\n115.8～126.7\n128.8～130.2\n145.6～148.9\n152.5～155.4\n169.8～174.7",null,132.69999999999999,null,2400,"2,400\n(5～10月)\n1,900\n(11～4月)","染色用","紡績","温調用の恒温水として必要","2023-02-28","５井四\n第57号"]
[]
[null,"（注）（）内は、それぞれ許可井戸を含み、工業用水法第５条第２項の適用前の合計量を記入すること"]

{"sheet":"ｼｰﾄ10","index":12,"n_rows":6,"n_cols":10,"rows_kept":6,"cut":false,"hidden":false,"merged":[[3,8,4,8],[3,9,4,9],[3,1,4,1],[3,2,4,2],[3,3,4,3],[3,4,4,4],[3,5,4,5],[3,6,3,7]]}
[1]
[{"$f":"IF(COUNTA(B6:J9)<>0,1,2)","v":1},"１０　工業用水法第９条に基づく届出書受理状況"]
[]
[null,"許可又は\n届出番号","受理日","許可又は\n届出年月日","氏名（名称）","住 　所","変更の内容",null,"変更年月日","変更理由"]
[null,null,null,null,null,null,"変更前","変更後"]
[null,"５井四\n第67号及び\n５井四\n第71号","2023-06-30","2023-06-30","JSR株式会社四日市工場","四日市市川尻町100番地","代表取締役社長\n川橋　信夫","代表取締役CEO兼社長\nエリック　ジョンソン","2023-06-16","役員の変更"]

{"sheet":"ｼｰﾄ12","index":13,"n_rows":5,"n_cols":9,"rows_kept":5,"cut":false,"hidden":false,"merged":[]}
[1]
[{"$f":"IF(COUNTA(B5:I8)<>0,1,2)","v":1},"１２　工業用水法第11条に基づく届出書受理状況"]
[]
[null,"番　号","許可又は\n届出番号","受理日","氏名（名称）","住 所","許可又は\n届出年月日","廃止年月日","廃止の内容"]
[null,"A-0103","47井四\n第103号","2023-10-30","東洋紡（株）\n三重工場","四日市市楠町\n本郷30番地","1972-05-22","2023-10-30","撤去"]

{"sheet":"ｼｰﾄ14","index":14,"n_rows":19,"n_cols":20,"rows_kept":19,"cut":false,"hidden":false,"merged":[[12,1,13,1],[12,2,14,2],[12,3,14,3],[15,1,16,1],[15,2,17,2],[15,3,17,3],[4,19,5,19],[6,1,7,1],[6,2,8,2],[6,3,8,3],[9,1,10,1],[9,2,11,2],[9,3,11,3],[4,1,5,1],[4,2,5,2],[4,3,5,3],[4,5,4,16],[4,17,5,17],[4,18,5,18]]}
[1]
[{"$f":"IF(COUNTA(B7,F7:Q8,F10:Q11,F13:Q14,F16:Q17)<>0,1,2)","v":1},"１４　工業用水法第24条の規定に基づく井戸使用状況報告"]
[]
[]
[null,"指定地域名","許可件数","井戸本数",null,"令和５年度月別採取量  (㎥/日）",null,null,null,null,null,null,null,null,null,null,null,"1年間合計","1日平均\n(㎥/日)","前年度\n1日平均\n(㎥/日)"]
[null,null,null,null,null,4,5,6,7,8,9,10,11,12,1,2,3]
[null,"旧規制地域\n（四日市市）",5,8,"月間採取量(㎥）",4029,6387,16085,68933,65523,27958,8198.4,5447,3716,4472,3224,4911,{"$f":"IF(AND(COUNT(F7:Q7)=COUNT(F8:Q8),SUM(F7:Q7)<>0),SUM(F7:Q7),\"\")","v":218883.4},{"$f":"IF(AND(R7=\"\",R8=\"\"),\"\",R7/R8)","v":598.04207650273224},600.1452054794521]
[null,null,null,null,"月間稼働日数",30,31,30,31,31,30,31,30,31,31,29,31,{"$f":"IF(AND(COUNT(F7:Q7)=COUNT(F8:Q8),SUM(F8:Q8)<>0),SUM(F8:Q8),\"\")","v":366}]
[null,null,null,null,"月別日当採取量",{"$f":"IF(AND(F7=\"\",F8=\"\"),\"\",IF(AND(F7=0,F8=0),0,F7/F8))","v":134.30000000000001},206.03225806451613,536.16666666666663,2223.6451612903224,2113.6451612903224,931.93333333333328,264.46451612903223,181.56666666666666,119.87096774193549,144.25806451612902,111.17241379310344,158.41935483870967]
[null,"拡大規制地域\n（四日市市）",7,20,"月間採取量(㎥）",107661.3,143365.79999999999,136216.9,143623,133503.9,141948.9,144731.29999999999,166241.29999999999,159476.4,114927.7,112769.4,113713.60000000001,{"$f":"IF(AND(COUNT(F10:Q10)=COUNT(F11:Q11),SUM(F10:Q10)<>0),SUM(F10:Q10),\"\")","v":1618179.5},{"$f":"IF(AND(R10=\"\",R11=\"\"),\"\",R10/R11)","v":4421.2554644808743},4678.2575342465752]
[null,null,null,null,"月間稼働日数",30,31,30,31,31,30,31,30,31,31,29,31,{"$f":"IF(AND(COUNT(F10:Q10)=COUNT(F11:Q11),SUM(F11:Q11)<>0),SUM(F11:Q11),\"\")","v":366}]
[null,null,null,null,"月別日当採取量",{"$f":"IF(AND(F10=\"\",F11=\"\"),\"\",IF(AND(F10=0,F11=0),0,F10/F11))","v":3588.71},4624.703225806451,4540.5633333333335,4633,4306.5774193548386,4731.63,4668.7516129032256,5541.3766666666661,5144.3999999999996,3707.3451612903223,3888.6,3668.1806451612906]
[null,null,null,null,"月間採取量(㎥）",null,null,null,null,null,null,null,null,null,null,null,null,{"$f":"IF(AND(COUNT(F13:Q13)=COUNT(F14:Q14),SUM(F13:Q13)<>0),SUM(F13:Q13),\"\")","v":""},{"$f":"IF(AND(R13=\"\",R14=\"\"),\"\",R13/R14)","v":""}]
[null,null,null,null,"月間稼働日数",null,null,null,null,null,null,null,null,null,null,null,null,{"$f":"IF(AND(COUNT(F13:Q13)=COUNT(F14:Q14),SUM(F14:Q14)<>0),SUM(F14:Q14),\"\")","v":""}]
[null,"小　計",null,null,"月別日当採取量",{"$f":"IF(AND(F13=\"\",F14=\"\"),\"\",IF(AND(F13=0,F14=0),0,F13/F14))","v":""},"","","","","","","","","","",""]
[null,null,null,null,"月間採取量(㎥）",null,null,null,null,null,null,null,null,null,null,null,null,{"$f":"IF(AND(COUNT(F16:Q16)=COUNT(F17:Q17),SUM(F16:Q16)<>0),SUM(F16:Q16),\"\")","v":""},{"$f":"IF(AND(R16=\"\",R17=\"\"),\"\",R16/R17)","v":""}]
[null,null,null,null,"月間稼働日数",null,null,null,null,null,null,null,null,null,null,null,null,{"$f":"IF(AND(COUNT(F16:Q16)=COUNT(F17:Q17),SUM(F17:Q17)<>0),SUM(F17:Q17),\"\")","v":""}]
[null,"小　計",null,null,"月別日当採取量",{"$f":"IF(AND(F16=\"\",F17=\"\"),\"\",IF(AND(F16=0,F17=0),0,F16/F17))","v":""},"","","","","","","","","","",""]
[null,null,null,null,"月別日当り採取量\n合計",{"$f":"IF(AND(F9=\"\",F12=\"\",F15=\"\",F18=\"\"),\"\",IF(OR(ISNUMBER(F9),ISNUMBER(F12),ISNUMBER(F15),ISNUMBER(F18)),SUM(F9,F12,F15,F18)))","v":3723.01},{"$f":"IF(AND(G9=\"\",G12=\"\",G15=\"\",G18=\"\"),\"\",IF(OR(ISNUMBER(G9),ISNUMBER(G12),ISNUMBER(G15),ISNUMBER(G18)),SUM(G9,G12,G15,G18)))","v":4830.7354838709671},5076.7300000000005,6856.645161290322,6420.2225806451606,5663.5633333333335,4933.2161290322574,5722.9433333333327,5264.2709677419352,3851.6032258064515,3999.7724137931032,3826.6000000000004,{"$f":"IF(COUNT(R7,R10,R13,R16)<>0,SUM(R7,R10,R13,R16),\"\")","v":1837062.9},{"$f":"IF(COUNT(S7,S10,S13,S16)<>0,SUM(S7,S10,S13,S16),\"\")","v":5019.2975409836063}]

{"sheet":"Sheet1","index":15,"n_rows":0,"n_cols":0,"rows_kept":0,"cut":false,"hidden":true,"merged":[]}