{"text_format":"1","workbook":"xlsx","n_sheets":6,"sheets":["更新履歴","記入票","結果表","副次的な取組","非表示⇒","一覧"],"not_rendered":{"charts":1,"images":0,"macros":1,"external_links":0,"defined_names":14,"comments":0,"pivot_tables":0},"unopened":[],"bounds":{"document_bytes":16777216,"sheet_cells":100000,"rows_first":2000,"rows_last":500,"rows_between":2000,"halvings":0,"cell_chars":16384,"cell_head_chars":4096},"cells_cut":0,"cells_raw":0,"read":"whole","date_system":"1900"}

{"sheet":"更新履歴","index":0,"n_rows":4,"n_cols":5,"rows_kept":4,"cut":false,"hidden":false,"merged":[[1,1,1,4]]}
[]
[null,"更新履歴"]
[null,"日付","箇所","更新内容","理由"]
[null,"2022-01-28","-","初版リリース","-"]

{"sheet":"記入票","index":1,"n_rows":85,"n_cols":12,"rows_kept":85,"cut":false,"hidden":false,"merged":[[26,5,26,12],[20,2,20,12],[21,2,21,12],[22,2,22,12],[30,5,30,12],[66,2,66,3],[67,2,67,3],[68,2,68,3],[61,2,61,3],[37,2,37,3],[32,1,32,12],[28,1,28,2],[28,3,28,12],[51,2,51,3],[52,2,52,3],[46,2,46,3],[56,2,56,3],[57,2,57,3],[58,2,58,3],[59,2,59,3],[60,2,60,3],[63,2,63,3],[64,2,64,3],[65,2,65,3],[1,1,1,12],[3,1,3,12],[5,1,6,12],[8,1,8,2],[8,3,8,12],[10,1,10,12],[16,3,16,12],[24,1,24,12],[12,1,12,2],[16,1,16,2],[18,1,18,12],[14,1,14,2],[12,6,14,9],[40,2,40,3],[41,2,41,3],[42,2,42,3],[50,2,50,3],[53,2,53,3],[54,2,54,3],[55,2,55,3],[62,2,62,3],[34,2,34,3],[35,2,35,3],[36,2,36,3],[48,2,48,3],[49,2,49,3],[43,2,43,3],[44,2,44,3],[45,2,45,3],[38,2,38,3],[39,2,39,3],[47,2,47,3],[69,2,69,3],[84,2,84,3],[79,2,79,3],[80,2,80,3],[81,2,81,3],[70,2,70,3],[71,2,71,3],[72,2,72,3],[73,2,73,3],[74,2,74,3],[75,2,75,3],[82,2,82,3],[83,2,83,3],[76,2,76,3],[77,2,77,3],[78,2,78,3],[83,4,83,10],[84,4,84,10],[83,11,83,12],[84,11,84,12],[78,4,78,10],[79,4,79,10],[80,4,80,10],[81,4,81,10],[82,4,82,10],[78,11,78,12],[79,11,79,12],[80,11,80,12],[81,11,81,12],[82,11,82,12],[43,4,43,10],[44,4,44,10],[45,4,45,10],[46,4,46,10],[47,4,47,10],[48,4,48,10],[49,4,49,10],[50,4,50,10],[51,4,51,10],[34,4,34,10],[35,4,35,10],[36,4,36,10],[37,4,37,10],[38,4,38,10],[39,4,39,10],[40,4,40,10],[41,4,41,10],[42,4,42,10],[77,4,77,10],[60,4,60,10],[61,4,61,10],[62,4,62,10],[63,4,63,10],[64,4,64,10],[65,4,65,10],[66,4,66,10],[67,4,67,10],[68,4,68,10],[52,11,52,12],[69,4,69,10],[70,4,70,10],[71,4,71,10],[72,4,72,10],[73,4,73,10],[74,4,74,10],[75,4,75,10],[76,4,76,10],[52,4,52,10],[53,4,53,10],[54,4,54,10],[55,4,55,10],[56,4,56,10],[57,4,57,10],[58,4,58,10],[59,4,59,10],[53,11,53,12],[54,11,54,12],[55,11,55,12],[56,11,56,12],[57,11,57,12],[58,11,58,12],[59,11,59,12],[43,11,43,12],[44,11,44,12],[45,11,45,12],[46,11,46,12],[47,11,47,12],[48,11,48,12],[49,11,49,12],[50,11,50,12],[51,11,51,12],[34,11,34,12],[35,11,35,12],[36,11,36,12],[37,11,37,12],[38,11,38,12],[39,11,39,12],[40,11,40,12],[41,11,41,12],[42,11,42,12],[60,11,60,12],[61,11,61,12],[62,11,62,12],[63,11,63,12],[64,11,64,12],[65,11,65,12],[66,11,66,12],[67,11,67,12],[68,11,68,12],[69,11,69,12],[70,11,70,12],[71,11,71,12],[72,11,72,12],[73,11,73,12],[74,11,74,12],[75,11,75,12],[76,11,76,12],[77,11,77,12]]}
[]
[null,"脱炭素先行地域づくり自治体向け算定支援ファイル"]
[]
[null,"記入票"]
[]
[null,"入力する数値に関しては、必要に応じて算定支援ファイル内で表示されている小数点の位まで入力し、それ以下の小数点については四捨五入してください。"]
[]
[]
[null,"自治体名",null,"○○県××市"]
[]
[null,"事業開始前の電力消費量"]
[]
[null,"事業開始前の\n電力消費量",null,null,"kWh",null,"対象となる地域全体の電力消費量を記入してください。\n電力消費量に基づいて、（ベースラインを商用電力とした場合の）CO2排出量が自動的に算出されます。"]
[]
[null,"事業開始前の\nCO2排出量",null,{"$f":"IF($D$13=\"\",\"\",$D$13*0.47)","v":""},"tCO2"]
[]
[null,"上記の設定根拠",null,"参考にした資料がある場合は、資料名、発行年、発行者、URL等を記載してください。"]
[]
[null,"チェックリスト"]
[]
[null,"✔","チェック項目"]
[null,null,"入力ガイドや各算定支援ファイルに記載された注意点を順守して算定支援ファイルを作成していますか。\n⇒各算定支援ファイルの「算定シート」下部に記載されたチェック項目にて警告が出ていないかを確認してください。"]
[null,null,"最新の算定支援ファイル（最大50ファイル）をとりまとめて、1つのフォルダに格納していますか。\n⇒集計作業前に、該当フォルダへの算定支援ファイルの格納・更新漏れがないか、確認してください。"]
[]
[null,"集計作業"]
[]
[null,null,null,null,null,"フォルダパス抽出ボタンをクリックして、算定支援ファイルが格納されたフォルダを選択すると、下記にフォルダのパスが転記されます。\n⇒下記のセルに直接格納フォルダのパスを入力することも可能です。"]
[]
[null,"フォルダのパス"]
[]
[null,null,null,null,null,"集計ボタンををクリックすると、各算定支援ファイルの結果が自動的に集計されます。\n⇒下記の「集計対象となる算定支援ファイル」のリストに過不足がないかを確認してください。"]
[]
[null,"集計対象となる算定支援ファイル"]
[]
[null,"番号","分野",null,"ファイル名",null,null,null,null,null,null,"電力削減量合計（kWh）"]
[null,{"$f":"IFERROR(_xlfn._xlws.FILTER(一覧!$B$7:$B$43,一覧!$I$7:$I$43=\"○\"),\"\")","v":""},{"$f":"IF($B36=\"\",\"\",VLOOKUP($B36,一覧!$B$7:$I$56,一覧!$D$1,FALSE))","v":""},null,{"$f":"IF($B36=\"\",\"\",VLOOKUP(記入票!$B36,一覧!$B$7:$I$56,一覧!$C$1,FALSE))","v":""},null,null,null,null,null,null,{"$f":"IF($B36=\"\",\"\",VLOOKUP(記入票!$B36,一覧!$B$7:$I$56,一覧!$H$1,FALSE))","v":""}]
[null,null,{"$f":"IF($B37=\"\",\"\",VLOOKUP($B37,一覧!$B$7:$I$56,一覧!$D$1,FALSE))","v":""},null,{"$f":"IF($B37=\"\",\"\",VLOOKUP(記入票!$B37,一覧!$B$7:$I$56,一覧!$C$1,FALSE))","v":""},null,null,null,null,null,null,{"$f":"IF($B37=\"\",\"\",VLOOKUP(記入票!$B37,一覧!$B$7:$I$56,一覧!$H$1,FALSE))","v":""}]
[null,null,{"$f":"IF($B38=\"\",\"\",VLOOKUP($B38,一覧!$B$7:$I$56,一覧!$D$1,FALSE))","v":""},null,{"$f":"IF($B38=\"\",\"\",VLOOKUP(記入票!$B38,一覧!$B$7:$I$56,一覧!$C$1,FALSE))","v":""},null,null,null,null,null,null,{"$f":"IF($B38=\"\",\"\",VLOOKUP(記入票!$B38,一覧!$B$7:$I$56,一覧!$H$1,FALSE))","v":""}]
[null,null,{"$f":"IF($B39=\"\",\"\",VLOOKUP($B39,一覧!$B$7:$I$56,一覧!$D$1,FALSE))","v":""},null,{"$f":"IF($B39=\"\",\"\",VLOOKUP(記入票!$B39,一覧!$B$7:$I$56,一覧!$C$1,FALSE))","v":""},null,null,null,null,null,null,{"$f":"IF($B39=\"\",\"\",VLOOKUP(記入票!$B39,一覧!$B$7:$I$56,一覧!$H$1,FALSE))","v":""}]
[null,null,{"$f":"IF($B40=\"\",\"\",VLOOKUP($B40,一覧!$B$7:$I$56,一覧!$D$1,FALSE))","v":""},null,{"$f":"IF($B40=\"\",\"\",VLOOKUP(記入票!$B40,一覧!$B$7:$I$56,一覧!$C$1,FALSE))","v":""},null,null,null,null,null,null,{"$f":"IF($B40=\"\",\"\",VLOOKUP(記入票!$B40,一覧!$B$7:$I$56,一覧!$H$1,FALSE))","v":""}]
[null,null,{"$f":"IF($B41=\"\",\"\",VLOOKUP($B41,一覧!$B$7:$I$56,一覧!$D$1,FALSE))","v":""},null,{"$f":"IF($B41=\"\",\"\",VLOOKUP(記入票!$B41,一覧!$B$7:$I$56,一覧!$C$1,FALSE))","v":""},null,null,null,null,null,null,{"$f":"IF($B41=\"\",\"\",VLOOKUP(記入票!$B41,一覧!$B$7:$I$56,一覧!$H$1,FALSE))","v":""}]
[null,null,{"$f":"IF($B42=\"\",\"\",VLOOKUP($B42,一覧!$B$7:$I$56,一覧!$D$1,FALSE))","v":""},null,{"$f":"IF($B42=\"\",\"\",VLOOKUP(記入票!$B42,一覧!$B$7:$I$56,一覧!$C$1,FALSE))","v":""},null,null,null,null,null,null,{"$f":"IF($B42=\"\",\"\",VLOOKUP(記入票!$B42,一覧!$B$7:$I$56,一覧!$H$1,FALSE))","v":""}]
[null,null,{"$f":"IF($B43=\"\",\"\",VLOOKUP($B43,一覧!$B$7:$I$56,一覧!$D$1,FALSE))","v":""},null,{"$f":"IF($B43=\"\",\"\",VLOOKUP(記入票!$B43,一覧!$B$7:$I$56,一覧!$C$1,FALSE))","v":""},null,null,null,null,null,null,{"$f":"IF($B43=\"\",\"\",VLOOKUP(記入票!$B43,一覧!$B$7:$I$56,一覧!$H$1,FALSE))","v":""}]
[null,null,{"$f":"IF($B44=\"\",\"\",VLOOKUP($B44,一覧!$B$7:$I$56,一覧!$D$1,FALSE))","v":""},null,{"$f":"IF($B44=\"\",\"\",VLOOKUP(記入票!$B44,一覧!$B$7:$I$56,一覧!$C$1,FALSE))","v":""},null,null,null,null,null,null,{"$f":"IF($B44=\"\",\"\",VLOOKUP(記入票!$B44,一覧!$B$7:$I$56,一覧!$H$1,FALSE))","v":""}]
[null,null,{"$f":"IF($B45=\"\",\"\",VLOOKUP($B45,一覧!$B$7:$I$56,一覧!$D$1,FALSE))","v":""},null,{"$f":"IF($B45=\"\",\"\",VLOOKUP(記入票!$B45,一覧!$B$7:$I$56,一覧!$C$1,FALSE))","v":""},null,null,null,null,null,null,{"$f":"IF($B45=\"\",\"\",VLOOKUP(記入票!$B45,一覧!$B$7:$I$56,一覧!$H$1,FALSE))","v":""}]
[null,null,{"$f":"IF($B46=\"\",\"\",VLOOKUP($B46,一覧!$B$7:$I$56,一覧!$D$1,FALSE))","v":""},null,{"$f":"IF($B46=\"\",\"\",VLOOKUP(記入票!$B46,一覧!$B$7:$I$56,一覧!$C$1,FALSE))","v":""},null,null,null,null,null,null,{"$f":"IF($B46=\"\",\"\",VLOOKUP(記入票!$B46,一覧!$B$7:$I$56,一覧!$H$1,FALSE))","v":""}]
[null,null,{"$f":"IF($B47=\"\",\"\",VLOOKUP($B47,一覧!$B$7:$I$56,一覧!$D$1,FALSE))","v":""},null,{"$f":"IF($B47=\"\",\"\",VLOOKUP(記入票!$B47,一覧!$B$7:$I$56,一覧!$C$1,FALSE))","v":""},null,null,null,null,null,null,{"$f":"IF($B47=\"\",\"\",VLOOKUP(記入票!$B47,一覧!$B$7:$I$56,一覧!$H$1,FALSE))","v":""}]
[null,null,{"$f":"IF($B48=\"\",\"\",VLOOKUP($B48,一覧!$B$7:$I$56,一覧!$D$1,FALSE))","v":""},null,{"$f":"IF($B48=\"\",\"\",VLOOKUP(記入票!$B48,一覧!$B$7:$I$56,一覧!$C$1,FALSE))","v":""},null,null,null,null,null,null,{"$f":"IF($B48=\"\",\"\",VLOOKUP(記入票!$B48,一覧!$B$7:$I$56,一覧!$H$1,FALSE))","v":""}]
[null,null,{"$f":"IF($B49=\"\",\"\",VLOOKUP($B49,一覧!$B$7:$I$56,一覧!$D$1,FALSE))","v":""},null,{"$f":"IF($B49=\"\",\"\",VLOOKUP(記入票!$B49,一覧!$B$7:$I$56,一覧!$C$1,FALSE))","v":""},null,null,null,null,null,null,{"$f":"IF($B49=\"\",\"\",VLOOKUP(記入票!$B49,一覧!$B$7:$I$56,一覧!$H$1,FALSE))","v":""}]
[null,null,{"$f":"IF($B50=\"\",\"\",VLOOKUP($B50,一覧!$B$7:$I$56,一覧!$D$1,FALSE))","v":""},null,{"$f":"IF($B50=\"\",\"\",VLOOKUP(記入票!$B50,一覧!$B$7:$I$56,一覧!$C$1,FALSE))","v":""},null,null,null,null,null,null,{"$f":"IF($B50=\"\",\"\",VLOOKUP(記入票!$B50,一覧!$B$7:$I$56,一覧!$H$1,FALSE))","v":""}]
[null,null,{"$f":"IF($B51=\"\",\"\",VLOOKUP($B51,一覧!$B$7:$I$56,一覧!$D$1,FALSE))","v":""},null,{"$f":"IF($B51=\"\",\"\",VLOOKUP(記入票!$B51,一覧!$B$7:$I$56,一覧!$C$1,FALSE))","v":""},null,null,null,null,null,null,{"$f":"IF($B51=\"\",\"\",VLOOKUP(記入票!$B51,一覧!$B$7:$I$56,一覧!$H$1,FALSE))","v":""}]
[null,null,{"$f":"IF($B52=\"\",\"\",VLOOKUP($B52,一覧!$B$7:$I$56,一覧!$D$1,FALSE))","v":""},null,{"$f":"IF($B52=\"\",\"\",VLOOKUP(記入票!$B52,一覧!$B$7:$I$56,一覧!$C$1,FALSE))","v":""},null,null,null,null,null,null,{"$f":"IF($B52=\"\",\"\",VLOOKUP(記入票!$B52,一覧!$B$7:$I$56,一覧!$H$1,FALSE))","v":""}]
[null,null,{"$f":"IF($B53=\"\",\"\",VLOOKUP($B53,一覧!$B$7:$I$56,一覧!$D$1,FALSE))","v":""},null,{"$f":"IF($B53=\"\",\"\",VLOOKUP(記入票!$B53,一覧!$B$7:$I$56,一覧!$C$1,FALSE))","v":""},null,null,null,null,null,null,{"$f":"IF($B53=\"\",\"\",VLOOKUP(記入票!$B53,一覧!$B$7:$I$56,一覧!$H$1,FALSE))","v":""}]
[null,null,{"$f":"IF($B54=\"\",\"\",VLOOKUP($B54,一覧!$B$7:$I$56,一覧!$D$1,FALSE))","v":""},null,{"$f":"IF($B54=\"\",\"\",VLOOKUP(記入票!$B54,一覧!$B$7:$I$56,一覧!$C$1,FALSE))","v":""},null,null,null,null,null,null,{"$f":"IF($B54=\"\",\"\",VLOOKUP(記入票!$B54,一覧!$B$7:$I$56,一覧!$H$1,FALSE))","v":""}]
[null,null,{"$f":"IF($B55=\"\",\"\",VLOOKUP($B55,一覧!$B$7:$I$56,一覧!$D$1,FALSE))","v":""},null,{"$f":"IF($B55=\"\",\"\",VLOOKUP(記入票!$B55,一覧!$B$7:$I$56,一覧!$C$1,FALSE))","v":""},null,null,null,null,null,null,{"$f":"IF($B55=\"\",\"\",VLOOKUP(記入票!$B55,一覧!$B$7:$I$56,一覧!$H$1,FALSE))","v":""}]
[null,null,{"$f":"IF($B56=\"\",\"\",VLOOKUP($B56,一覧!$B$7:$I$56,一覧!$D$1,FALSE))","v":""},null,{"$f":"IF($B56=\"\",\"\",VLOOKUP(記入票!$B56,一覧!$B$7:$I$56,一覧!$C$1,FALSE))","v":""},null,null,null,null,null,null,{"$f":"IF($B56=\"\",\"\",VLOOKUP(記入票!$B56,一覧!$B$7:$I$56,一覧!$H$1,FALSE))","v":""}]
[null,null,{"$f":"IF($B57=\"\",\"\",VLOOKUP($B57,一覧!$B$7:$I$56,一覧!$D$1,FALSE))","v":""},null,{"$f":"IF($B57=\"\",\"\",VLOOKUP(記入票!$B57,一覧!$B$7:$I$56,一覧!$C$1,FALSE))","v":""},null,null,null,null,null,null,{"$f":"IF($B57=\"\",\"\",VLOOKUP(記入票!$B57,一覧!$B$7:$I$56,一覧!$H$1,FALSE))","v":""}]
[null,null,{"$f":"IF($B58=\"\",\"\",VLOOKUP($B58,一覧!$B$7:$I$56,一覧!$D$1,FALSE))","v":""},null,{"$f":"IF($B58=\"\",\"\",VLOOKUP(記入票!$B58,一覧!$B$7:$I$56,一覧!$C$1,FALSE))","v":""},null,null,null,null,null,null,{"$f":"IF($B58=\"\",\"\",VLOOKUP(記入票!$B58,一覧!$B$7:$I$56,一覧!$H$1,FALSE))","v":""}]
[null,null,{"$f":"IF($B59=\"\",\"\",VLOOKUP($B59,一覧!$B$7:$I$56,一覧!$D$1,FALSE))","v":""},null,{"$f":"IF($B59=\"\",\"\",VLOOKUP(記入票!$B59,一覧!$B$7:$I$56,一覧!$C$1,FALSE))","v":""},null,null,null,null,null,null,{"$f":"IF($B59=\"\",\"\",VLOOKUP(記入票!$B59,一覧!$B$7:$I$56,一覧!$H$1,FALSE))","v":""}]
[null,null,{"$f":"IF($B60=\"\",\"\",VLOOKUP($B60,一覧!$B$7:$I$56,一覧!$D$1,FALSE))","v":""},null,{"$f":"IF($B60=\"\",\"\",VLOOKUP(記入票!$B60,一覧!$B$7:$I$56,一覧!$C$1,FALSE))","v":""},null,null,null,null,null,null,{"$f":"IF($B60=\"\",\"\",VLOOKUP(記入票!$B60,一覧!$B$7:$I$56,一覧!$H$1,FALSE))","v":""}]
[null,null,{"$f":"IF($B61=\"\",\"\",VLOOKUP($B61,一覧!$B$7:$I$56,一覧!$D$1,FALSE))","v":""},null,{"$f":"IF($B61=\"\",\"\",VLOOKUP(記入票!$B61,一覧!$B$7:$I$56,一覧!$C$1,FALSE))","v":""},null,null,null,null,null,null,{"$f":"IF($B61=\"\",\"\",VLOOKUP(記入票!$B61,一覧!$B$7:$I$56,一覧!$H$1,FALSE))","v":""}]
[null,null,{"$f":"IF($B62=\"\",\"\",VLOOKUP($B62,一覧!$B$7:$I$56,一覧!$D$1,FALSE))","v":""},null,{"$f":"IF($B62=\"\",\"\",VLOOKUP(記入票!$B62,一覧!$B$7:$I$56,一覧!$C$1,FALSE))","v":""},null,null,null,null,null,null,{"$f":"IF($B62=\"\",\"\",VLOOKUP(記入票!$B62,一覧!$B$7:$I$56,一覧!$H$1,FALSE))","v":""}]
[null,null,{"$f":"IF($B63=\"\",\"\",VLOOKUP($B63,一覧!$B$7:$I$56,一覧!$D$1,FALSE))","v":""},null,{"$f":"IF($B63=\"\",\"\",VLOOKUP(記入票!$B63,一覧!$B$7:$I$56,一覧!$C$1,FALSE))","v":""},null,null,null,null,null,null,{"$f":"IF($B63=\"\",\"\",VLOOKUP(記入票!$B63,一覧!$B$7:$I$56,一覧!$H$1,FALSE))","v":""}]
[null,null,{"$f":"IF($B64=\"\",\"\",VLOOKUP($B64,一覧!$B$7:$I$56,一覧!$D$1,FALSE))","v":""},null,{"$f":"IF($B64=\"\",\"\",VLOOKUP(記入票!$B64,一覧!$B$7:$I$56,一覧!$C$1,FALSE))","v":""},null,null,null,null,null,null,{"$f":"IF($B64=\"\",\"\",VLOOKUP(記入票!$B64,一覧!$B$7:$I$56,一覧!$H$1,FALSE))","v":""}]
[null,null,{"$f":"IF($B65=\"\",\"\",VLOOKUP($B65,一覧!$B$7:$I$56,一覧!$D$1,FALSE))","v":""},null,{"$f":"IF($B65=\"\",\"\",VLOOKUP(記入票!$B65,一覧!$B$7:$I$56,一覧!$C$1,FALSE))","v":""},null,null,null,null,null,null,{"$f":"IF($B65=\"\",\"\",VLOOKUP(記入票!$B65,一覧!$B$7:$I$56,一覧!$H$1,FALSE))","v":""}]
[null,null,{"$f":"IF($B66=\"\",\"\",VLOOKUP($B66,一覧!$B$7:$I$56,一覧!$D$1,FALSE))","v":""},null,{"$f":"IF($B66=\"\",\"\",VLOOKUP(記入票!$B66,一覧!$B$7:$I$56,一覧!$C$1,FALSE))","v":""},null,null,null,null,null,null,{"$f":"IF($B66=\"\",\"\",VLOOKUP(記入票!$B66,一覧!$B$7:$I$56,一覧!$H$1,FALSE))","v":""}]
[null,null,{"$f":"IF($B67=\"\",\"\",VLOOKUP($B67,一覧!$B$7:$I$56,一覧!$D$1,FALSE))","v":""},null,{"$f":"IF($B67=\"\",\"\",VLOOKUP(記入票!$B67,一覧!$B$7:$I$56,一覧!$C$1,FALSE))","v":""},null,null,null,null,null,null,{"$f":"IF($B67=\"\",\"\",VLOOKUP(記入票!$B67,一覧!$B$7:$I$56,一覧!$H$1,FALSE))","v":""}]
[null,null,{"$f":"IF($B68=\"\",\"\",VLOOKUP($B68,一覧!$B$7:$I$56,一覧!$D$1,FALSE))","v":""},null,{"$f":"IF($B68=\"\",\"\",VLOOKUP(記入票!$B68,一覧!$B$7:$I$56,一覧!$C$1,FALSE))","v":""},null,null,null,null,null,null,{"$f":"IF($B68=\"\",\"\",VLOOKUP(記入票!$B68,一覧!$B$7:$I$56,一覧!$H$1,FALSE))","v":""}]
[null,null,{"$f":"IF($B69=\"\",\"\",VLOOKUP($B69,一覧!$B$7:$I$56,一覧!$D$1,FALSE))","v":""},null,{"$f":"IF($B69=\"\",\"\",VLOOKUP(記入票!$B69,一覧!$B$7:$I$56,一覧!$C$1,FALSE))","v":""},null,null,null,null,null,null,{"$f":"IF($B69=\"\",\"\",VLOOKUP(記入票!$B69,一覧!$B$7:$I$56,一覧!$H$1,FALSE))","v":""}]
[null,null,{"$f":"IF($B70=\"\",\"\",VLOOKUP($B70,一覧!$B$7:$I$56,一覧!$D$1,FALSE))","v":""},null,{"$f":"IF($B70=\"\",\"\",VLOOKUP(記入票!$B70,一覧!$B$7:$I$56,一覧!$C$1,FALSE))","v":""},null,null,null,null,null,null,{"$f":"IF($B70=\"\",\"\",VLOOKUP(記入票!$B70,一覧!$B$7:$I$56,一覧!$H$1,FALSE))","v":""}]
[null,null,{"$f":"IF($B71=\"\",\"\",VLOOKUP($B71,一覧!$B$7:$I$56,一覧!$D$1,FALSE))","v":""},null,{"$f":"IF($B71=\"\",\"\",VLOOKUP(記入票!$B71,一覧!$B$7:$I$56,一覧!$C$1,FALSE))","v":""},null,null,null,null,null,null,{"$f":"IF($B71=\"\",\"\",VLOOKUP(記入票!$B71,一覧!$B$7:$I$56,一覧!$H$1,FALSE))","v":""}]
[null,null,{"$f":"IF($B72=\"\",\"\",VLOOKUP($B72,一覧!$B$7:$I$56,一覧!$D$1,FALSE))","v":""},null,{"$f":"IF($B72=\"\",\"\",VLOOKUP(記入票!$B72,一覧!$B$7:$I$56,一覧!$C$1,FALSE))","v":""},null,null,null,null,null,null,{"$f":"IF($B72=\"\",\"\",VLOOKUP(記入票!$B72,一覧!$B$7:$I$56,一覧!$H$1,FALSE))","v":""}]
[null,null,{"$f":"IF($B73=\"\",\"\",VLOOKUP($B73,一覧!$B$7:$I$56,一覧!$D$1,FALSE))","v":""},null,{"$f":"IF($B73=\"\",\"\",VLOOKUP(記入票!$B73,一覧!$B$7:$I$56,一覧!$C$1,FALSE))","v":""},null,null,null,null,null,null,{"$f":"IF($B73=\"\",\"\",VLOOKUP(記入票!$B73,一覧!$B$7:$I$56,一覧!$H$1,FALSE))","v":""}]
[null,null,{"$f":"IF($B74=\"\",\"\",VLOOKUP($B74,一覧!$B$7:$I$56,一覧!$D$1,FALSE))","v":""},null,{"$f":"IF($B74=\"\",\"\",VLOOKUP(記入票!$B74,一覧!$B$7:$I$56,一覧!$C$1,FALSE))","v":""},null,null,null,null,null,null,{"$f":"IF($B74=\"\",\"\",VLOOKUP(記入票!$B74,一覧!$B$7:$I$56,一覧!$H$1,FALSE))","v":""}]
[null,null,{"$f":"IF($B75=\"\",\"\",VLOOKUP($B75,一覧!$B$7:$I$56,一覧!$D$1,FALSE))","v":""},null,{"$f":"IF($B75=\"\",\"\",VLOOKUP(記入票!$B75,一覧!$B$7:$I$56,一覧!$C$1,FALSE))","v":""},null,null,null,null,null,null,{"$f":"IF($B75=\"\",\"\",VLOOKUP(記入票!$B75,一覧!$B$7:$I$56,一覧!$H$1,FALSE))","v":""}]
[null,null,{"$f":"IF($B76=\"\",\"\",VLOOKUP($B76,一覧!$B$7:$I$56,一覧!$D$1,FALSE))","v":""},null,{"$f":"IF($B76=\"\",\"\",VLOOKUP(記入票!$B76,一覧!$B$7:$I$56,一覧!$C$1,FALSE))","v":""},null,null,null,null,null,null,{"$f":"IF($B76=\"\",\"\",VLOOKUP(記入票!$B76,一覧!$B$7:$I$56,一覧!$H$1,FALSE))","v":""}]
[null,null,{"$f":"IF($B77=\"\",\"\",VLOOKUP($B77,一覧!$B$7:$I$56,一覧!$D$1,FALSE))","v":""},null,{"$f":"IF($B77=\"\",\"\",VLOOKUP(記入票!$B77,一覧!$B$7:$I$56,一覧!$C$1,FALSE))","v":""},null,null,null,null,null,null,{"$f":"IF($B77=\"\",\"\",VLOOKUP(記入票!$B77,一覧!$B$7:$I$56,一覧!$H$1,FALSE))","v":""}]
[null,null,{"$f":"IF($B78=\"\",\"\",VLOOKUP($B78,一覧!$B$7:$I$56,一覧!$D$1,FALSE))","v":""},null,{"$f":"IF($B78=\"\",\"\",VLOOKUP(記入票!$B78,一覧!$B$7:$I$56,一覧!$C$1,FALSE))","v":""},null,null,null,null,null,null,{"$f":"IF($B78=\"\",\"\",VLOOKUP(記入票!$B78,一覧!$B$7:$I$56,一覧!$H$1,FALSE))","v":""}]
[null,null,{"$f":"IF($B79=\"\",\"\",VLOOKUP($B79,一覧!$B$7:$I$56,一覧!$D$1,FALSE))","v":""},null,{"$f":"IF($B79=\"\",\"\",VLOOKUP(記入票!$B79,一覧!$B$7:$I$56,一覧!$C$1,FALSE))","v":""},null,null,null,null,null,null,{"$f":"IF($B79=\"\",\"\",VLOOKUP(記入票!$B79,一覧!$B$7:$I$56,一覧!$H$1,FALSE))","v":""}]
[null,null,{"$f":"IF($B80=\"\",\"\",VLOOKUP($B80,一覧!$B$7:$I$56,一覧!$D$1,FALSE))","v":""},null,{"$f":"IF($B80=\"\",\"\",VLOOKUP(記入票!$B80,一覧!$B$7:$I$56,一覧!$C$1,FALSE))","v":""},null,null,null,null,null,null,{"$f":"IF($B80=\"\",\"\",VLOOKUP(記入票!$B80,一覧!$B$7:$I$56,一覧!$H$1,FALSE))","v":""}]
{"$rows_left_out":6}
{"sheet":"結果表","index":2,"n_rows":39,"n_cols":8,"rows_kept":39,"cut":false,"hidden":false,"merged":[[5,1,5,2],[1,1,1,8],[3,1,3,8],[5,3,5,8],[7,1,7,8]]}
[]
[null,"脱炭素先行地域づくり自治体向け算定支援ファイル"]
[]
[null,"結果表"]
[]
[null,"自治体名",null,{"$f":"記入票!$D$9","v":"○○県××市"}]
[]
[null,"電力削減量見込の概観"]
[]
[]
[]
[]
[]
[]
[]
[]
[]
[]
[]
[]
[]
[]
[]
[]
[]
[]
[]
[]
[]
[null,null,"電力消費量","電力削減量",null,null,null,"電力消費量"]
[null,null,"導入前","再エネ発電","ZEB・ZEH/断熱改修","電気式\nヒートポンプ\n空調","電気式\nヒートポンプ\n空調以外の\n省エネ設備","導入後"]
[null,"電力消費増減量[kWh]",{"$f":"記入票!$D$13","v":0},{"$f":"D$39","v":0},{"$f":"E$39","v":0},0,0,{"$f":"H$38","v":0}]
[null,"電力消費量に対する割合[％]",{"$f":"IFERROR(C32/記入票!$D$13,0)","v":0},{"$f":"IFERROR(D32/記入票!$D$13,0)","v":0},{"$f":"IFERROR(E32/記入票!$D$13,0)","v":0},{"$f":"IFERROR(F32/記入票!$D$13,0)","v":0},{"$f":"IFERROR(G32/記入票!$D$13,0)","v":0},{"$f":"IFERROR(H32/記入票!$D$13,0)","v":0}]
[]
[]
[null,null,"導入前","再エネ発電","ZEB・ZEH/断熱改修","電気式ヒートポンプ空調","電気式ヒートポンプ空調\n以外の省エネ設備","導入後"]
[null,null,"導入前","再エネ発電","ZEB・ZEH/断熱改修","電気式ヒートポンプ空調","電気式ヒートポンプ空調以外の省エネ設備","導入後"]
[null,"電力消費増減量[kWh]",{"$f":"C32","v":0},{"$f":"-D$39","v":0},{"$f":"-E$39","v":0},0,0,{"$f":"SUM(C38:G38)","v":0}]
[null,"電力消費増減[kWh]",{"$f":"記入票!$D$13","v":0},{"$f":"SUMIFS(一覧!$H$7:$H$56,一覧!$D$7:$D$56,結果表!D$37,一覧!$I$7:$I$56,一覧!$Q$7)","v":0},{"$f":"SUMIFS(一覧!$H$7:$H$56,一覧!$D$7:$D$56,結果表!E$37,一覧!$I$7:$I$56,一覧!$Q$7)","v":0},{"$f":"SUMIFS(一覧!$H$7:$H$56,一覧!$D$7:$D$56,結果表!F$37,一覧!$I$7:$I$56,一覧!$Q$7)","v":0},{"$f":"SUMIFS(一覧!$H$7:$H$56,一覧!$D$7:$D$56,結果表!G$37,一覧!$I$7:$I$56,一覧!$Q$7)","v":0}]

{"sheet":"副次的な取組","index":3,"n_rows":151,"n_cols":8,"rows_kept":151,"cut":false,"hidden":false,"merged":[[118,1,118,12],[108,1,108,2],[108,5,108,6],[110,1,110,2],[112,1,112,2],[112,3,112,12],[126,1,126,2],[126,5,126,12],[128,1,128,2],[128,3,128,12],[120,1,120,2],[120,5,120,6],[122,1,122,2],[124,1,124,2],[124,3,124,12],[106,1,106,12],[96,1,96,2],[96,5,96,6],[98,1,98,2],[100,1,100,2],[100,3,100,12],[114,1,114,2],[114,5,114,12],[116,1,116,2],[116,3,116,12],[94,1,94,12],[84,1,84,2],[84,5,84,6],[86,1,86,2],[88,1,88,2],[88,3,88,12],[102,1,102,2],[102,5,102,12],[104,1,104,2],[104,3,104,12],[82,1,82,12],[72,1,72,2],[72,5,72,6],[74,1,74,2],[76,1,76,2],[76,3,76,12],[90,1,90,2],[90,5,90,12],[92,1,92,2],[92,3,92,12],[70,1,70,12],[60,1,60,2],[60,5,60,6],[62,1,62,2],[64,1,64,2],[64,3,64,12],[78,1,78,2],[78,5,78,12],[80,1,80,2],[80,3,80,12],[58,1,58,12],[48,1,48,2],[48,5,48,6],[50,1,50,2],[52,1,52,2],[52,3,52,12],[66,1,66,2],[66,5,66,12],[68,1,68,2],[68,3,68,12],[46,1,46,12],[36,1,36,2],[36,5,36,6],[38,1,38,2],[40,1,40,2],[40,3,40,12],[54,1,54,2],[54,5,54,12],[56,1,56,2],[56,3,56,12],[34,1,34,12],[24,1,24,2],[24,5,24,6],[26,1,26,2],[28,1,28,2],[28,3,28,12],[42,1,42,2],[42,5,42,12],[44,1,44,2],[44,3,44,12],[1,1,1,12],[3,1,3,12],[5,1,6,12],[8,1,8,2],[8,3,8,12],[12,1,12,2],[30,1,30,2],[30,5,30,12],[32,1,32,2],[32,3,32,12],[16,1,16,2],[20,1,20,2],[20,3,20,12],[22,1,22,12],[16,3,16,12],[18,1,18,2],[18,5,18,12],[10,1,10,12],[12,5,12,6],[14,1,14,2]]}
[]
[null,"脱炭素先行地域づくり自治体向け算定支援ファイル"]
[]
[null,"副次的な取組"]
[]
[null,"入力する数値に関しては、必要に応じて算定支援ファイル内で表示されている小数点の位まで入力することとし、それ以下の小数点については四捨五入してください。"]
[]
[]
[null,"自治体名",null,{"$f":"記入票!D9","v":"○○県××市"}]
[]
[null,"取組記入欄①"]
[]
[null,"部門",null,"選択してください",null,"削減対象となる温室\n効果ガスの種類",null,"選択してください"]
[]
[null,"エネルギー転換の種類",null,"選択してください",null,"選択してください"]
[]
[null,"取組概要"]
[]
[null,"同取組による\nCO2削減効果",null,null,"tCO2","CO2以外の温室効果ガスの削減に係る取組の場合は、同程度の温室効果を及ぼす二酸化炭素の量に換算した値（単位：tCO2）を記入してください。"]
[]
[null,"上記の算定根拠",null,"参考にした資料がある場合は、資料名、発行年、発行者、URL等を記載してください。"]
[]
[null,"取組記入欄②"]
[]
[null,"部門",null,"選択してください",null,"削減対象となる温室\n効果ガスの種類",null,"選択してください"]
[]
[null,"エネルギー転換の種類",null,"選択してください",null,"選択してください"]
[]
[null,"取組概要"]
[]
[null,"同取組による\nCO2削減効果",null,null,"tCO2","CO2以外の温室効果ガスの削減に係る取組の場合は、同程度の温室効果を及ぼす二酸化炭素の量に換算した値（単位：tCO2）を記入してください。"]
[]
[null,"上記の算定根拠",null,"参考にした資料がある場合は、資料名、発行年、発行者、URL等を記載してください。"]
[]
[null,"取組記入欄③"]
[]
[null,"部門",null,"選択してください",null,"削減対象となる温室\n効果ガスの種類",null,"選択してください"]
[]
[null,"エネルギー転換の種類",null,"選択してください",null,"選択してください"]
[]
[null,"取組概要"]
[]
[null,"同取組による\nCO2削減効果",null,null,"tCO2","CO2以外の温室効果ガスの削減に係る取組の場合は、同程度の温室効果を及ぼす二酸化炭素の量に換算した値（単位：tCO2）を記入してください。"]
[]
[null,"上記の算定根拠",null,"参考にした資料がある場合は、資料名、発行年、発行者、URL等を記載してください。"]
[]
[null,"取組記入欄④"]
[]
[null,"部門",null,"選択してください",null,"削減対象となる温室\n効果ガスの種類",null,"選択してください"]
[]
[null,"エネルギー転換の種類",null,"選択してください",null,"選択してください"]
[]
[null,"取組概要"]
[]
[null,"同取組による\nCO2削減効果",null,null,"tCO2","CO2以外の温室効果ガスの削減に係る取組の場合は、同程度の温室効果を及ぼす二酸化炭素の量に換算した値（単位：tCO2）を記入してください。"]
[]
[null,"上記の算定根拠",null,"参考にした資料がある場合は、資料名、発行年、発行者、URL等を記載してください。"]
[]
[null,"取組記入欄⑤"]
[]
[null,"部門",null,"選択してください",null,"削減対象となる温室\n効果ガスの種類",null,"選択してください"]
[]
[null,"エネルギー転換の種類",null,"選択してください",null,"選択してください"]
[]
[null,"取組概要"]
[]
[null,"同取組による\nCO2削減効果",null,null,"tCO2","CO2以外の温室効果ガスの削減に係る取組の場合は、同程度の温室効果を及ぼす二酸化炭素の量に換算した値（単位：tCO2）を記入してください。"]
[]
[null,"上記の算定根拠",null,"参考にした資料がある場合は、資料名、発行年、発行者、URL等を記載してください。"]
[]
[null,"取組記入欄⑥"]
[]
[null,"部門",null,"選択してください",null,"削減対象となる温室\n効果ガスの種類",null,"選択してください"]
[]
[null,"エネルギー転換の種類",null,"選択してください",null,"選択してください"]
[]
[null,"取組概要"]
[]
[null,"同取組による\nCO2削減効果",null,null,"tCO2","CO2以外の温室効果ガスの削減に係る取組の場合は、同程度の温室効果を及ぼす二酸化炭素の量に換算した値（単位：tCO2）を記入してください。"]
[]
{"$rows_left_out":72}
{"sheet":"非表示⇒","index":4,"n_rows":0,"n_cols":0,"rows_kept":0,"cut":false,"hidden":true,"merged":[]}

{"sheet":"一覧","index":5,"n_rows":56,"n_cols":17,"rows_kept":56,"cut":false,"hidden":true,"merged":[[1,1,1,8]]}
[null,null,2,3,null,null,null,7]
[null,"脱炭素先行地域づくり自治体向け算定支援ファイル"]
[]
[null,"集計用ファイル（結果表）"]
[]
[null,"番号","ファイル名","計算ファイル種","導入前の電力消費量","導入後の電力消費量","再エネ電力導入量","電力削減\n効果合計","電力削減\n集計対象","機器導入前\nCO2排出量","機器導入後\nCO2排出量","単年でのCO2削減\n効果","CO2削減\n効果",null,null,"集計対象",2]
[null,null,null,null,null,null,null,{"$f":"IF($B7=\"\",\"\",$E7-$F7+$G7)","v":""},{"$f":"IF($B7=\"\",\"\",VLOOKUP($D7,$P$7:$Q$15,$Q$6,FALSE))","v":""},null,null,null,null,null,1,"再エネ発電","○"]
[null,null,null,null,null,null,null,{"$f":"IF($B8=\"\",\"\",$E8-$F8+$G8)","v":""},"",null,null,null,null,null,2,"蓄電池"]
[null,null,null,null,null,null,null,"","",null,null,null,null,null,3,"再エネ水素利用"]
[null,null,null,null,null,null,null,"","",null,null,null,null,null,4,"再エネ/未利用熱"]
[null,null,null,null,null,null,null,"","",null,null,null,null,null,5,"ZEB・ZEH/断熱改修","○"]
[null,null,null,null,null,null,null,"","",null,null,null,null,null,6,"電気式ヒートポンプ空調","○"]
[null,null,null,null,null,null,null,"","",null,null,null,null,null,7,"電気式ヒートポンプ空調以外の省エネ設備","○"]
[null,null,null,null,null,null,null,"","",null,null,null,null,null,8,"コジェネレーション"]
[null,null,null,null,null,null,null,"","",null,null,null,null,null,9,"電動車"]
[null,null,null,null,null,null,null,"",""]
[null,null,null,null,null,null,null,"",""]
[null,null,null,null,null,null,null,"",""]
[null,null,null,null,null,null,null,"",""]
[null,null,null,null,null,null,null,"",""]
[null,null,null,null,null,null,null,"",""]
[null,null,null,null,null,null,null,"",""]
[null,null,null,null,null,null,null,"",""]
[null,null,null,null,null,null,null,"",""]
[null,null,null,null,null,null,null,"",""]
[null,null,null,null,null,null,null,"",""]
[null,null,null,null,null,null,null,"",""]
[null,null,null,null,null,null,null,"",""]
[null,null,null,null,null,null,null,"",""]
[null,null,null,null,null,null,null,"",""]
[null,null,null,null,null,null,null,"",""]
[null,null,null,null,null,null,null,"",""]
[null,null,null,null,null,null,null,"",""]
[null,null,null,null,null,null,null,"",""]
[null,null,null,null,null,null,null,"",""]
[null,null,null,null,null,null,null,"",""]
[null,null,null,null,null,null,null,"",""]
[null,null,null,null,null,null,null,"",""]
[null,null,null,null,null,null,null,"",{"$f":"IF($B39=\"\",\"\",VLOOKUP($D39,$P$7:$Q$15,$Q$6,FALSE))","v":""}]
[null,null,null,null,null,null,null,"",""]
[null,null,null,null,null,null,null,"",""]
[null,null,null,null,null,null,null,"",""]
[null,null,null,null,null,null,null,"",""]
[null,null,null,null,null,null,null,"",""]
[null,null,null,null,null,null,null,"",""]
[null,null,null,null,null,null,null,"",""]
[null,null,null,null,null,null,null,"",""]
[null,null,null,null,null,null,null,"",""]
[null,null,null,null,null,null,null,"",""]
[null,null,null,null,null,null,null,"",""]
[null,null,null,null,null,null,null,"",""]
[null,null,null,null,null,null,null,"",""]
[null,null,null,null,null,null,null,"",""]
[null,null,null,null,null,null,null,"",""]
[null,null,null,null,null,null,null,"",""]
[null,null,null,null,null,null,null,"",""]